program: Orca
programVersion: 5.0.2
elementType: Cl F O O O O N C C C C C C C C C C C C C C C C C H H H H H H H H H H H H H H H H H
charge: 0
multiplicity: 1
keywords: wb97x-d3
keywords: def2-TZVPP
keywords: def2/J RIJCOSX
keywords: DEFGRID2
keywords: scfconv7
keywords: smallprint printgap noloewdin
keywords: NOSOSCF
formula: C17H17ClFNO4
InChI: InChI=1/C17H17ClFNO4/c1-9(2)15-16(21)20(17(22)24-15)13-8-14(11(18)7-12(13)19)23-10-5-3-4-6-10/h7-8,10H,3-6H2,1-2H3
41 atoms
Cl 3.494335 -2.737794 0.370892
F  -1.526949 -2.70546 0.553049
O  3.141125 0.08463 0.163357
O  -3.344623 1.321475 0.961027
O  -2.608552 -0.935151 -1.584205
O  -1.482501 1.318817 2.203992
N  -1.705264 0.014936 0.30606
C  3.20279 1.516969 0.202376
C  2.929536 2.150397 -1.171247
C  4.648452 1.901084 0.560494
C  4.310705 2.460274 -1.743475
C  5.087807 2.902981 -0.508411
C  1.955698 -0.530101 0.231158
C  0.718918 0.104499 0.199937
C  -0.453669 -0.631337 0.31398
C  1.976359 -1.926577 0.343824
C  -0.395719 -2.00595 0.435583
C  0.8146 -2.666493 0.440246
C  -2.706966 -0.204963 -0.628443
C  -3.804252 0.649441 -0.170377
C  -2.104365 0.925822 1.259522
C  -5.041809 0.830411 -0.63939
C  -5.993593 1.787761 -0.003647
C  -5.574105 0.086608 -1.818059
H  2.500222 1.874181 0.959612
H  2.380649 3.082799 -1.019752
H  2.314699 1.520787 -1.816475
H  5.277531 1.00972 0.510285
H  4.726554 2.292392 1.574387
H  4.282696 3.21342 -2.531432
H  4.759496 1.557667 -2.167149
H  6.168572 2.911404 -0.651087
H  4.787891 3.916197 -0.228694
H  0.64139 1.176432 0.079711
H  0.846736 -3.743442 0.537042
H  -6.823989 1.235015 0.441129
H  -5.549919 2.415611 0.764148
H  -6.426077 2.433323 -0.770086
H  -6.535151 -0.358517 -1.553067
H  -5.769585 0.78521 -2.634302
H  -4.923019 -0.698237 -2.186336
elementType: Cl F O N C H
totalener: -1573.89698883 hartree
nucrepener: 2229.42413093 hartree
electener: -3803.32111976 hartree
oneelecener: -6587.80591122 hartree
twoeener: 2784.48479146 hartree
cpcmener: -0.03422236 hartree
kineticenergy: 1568.66554494 hartree
xcener: -125.339796928129 hartree
chargesum: 0.0000000
charge: -0.073334 -0.210199 -0.331152 -0.258530 -0.460697 -0.434604 -0.070113 0.136962 -0.177947 -0.160418 -0.130691 -0.128701 0.313696 -0.176618 -0.034497 -0.035072 0.185019 -0.108427 0.366912 0.065456 0.446294 0.046808 -0.217552 -0.227991 0.106401 0.091248 0.092531 0.077113 0.082951 0.078073 0.072045 0.074794 0.074061 0.152560 0.136284 0.111757 0.100471 0.107816 0.105972 0.110752 0.100568
qa: -0.0733 -0.2102 -0.3312 -0.2585 -0.4607 -0.4346 -0.0701 0.1370 -0.1779 -0.1604 -0.1307 -0.1287 0.3137 -0.1766 -0.0345 -0.0351 0.1850 -0.1084 0.3669 0.0655 0.4463 0.0468 -0.2176 -0.2280 0.1064 0.0912 0.0925 0.0771 0.0830 0.0781 0.0720 0.0748 0.0741 0.1526 0.1363 0.1118 0.1005 0.1078 0.1060 0.1108 0.1006
va: 1.2406 1.0850 2.0866 2.1914 2.0558 2.0763 3.1284 3.7423 3.8871 3.9033 3.9239 3.9074 3.9248 3.9498 3.7094 3.9001 4.1314 3.9637 4.1485 3.6916 4.3500 3.7332 3.9258 3.9079 1.0059 1.0112 1.0122 1.0262 1.0130 1.0136 1.0138 1.0151 1.0088 1.0130 1.0137 0.9988 1.0156 0.9996 0.9968 0.9962 1.0293
dispcorr: -0.019292570 hartree
energy: -1573.916281397131
dipole: -0.84621 -0.48732 -1.33353 29.56233 -27.93418 1.62815 -11.50681 10.60276 -0.90405
magnitude: 2.29052 au
magnitude: 5.82204 debye
