program: Orca
programVersion: 5.0.2
elementType: Cl F O O O O N C C C C C C C C C C C C C C C C C H H H H H H H H H H H H H H H H H
charge: 0
multiplicity: 1
keywords: wb97x-d3
keywords: def2-TZVPP
keywords: def2/J RIJCOSX
keywords: DEFGRID2
keywords: scfconv7
keywords: smallprint printgap noloewdin
keywords: NOSOSCF
formula: C17H17ClFNO4
InChI: InChI=1/C17H17ClFNO4/c1-9(2)15-16(21)20(17(22)24-15)13-8-14(11(18)7-12(13)19)23-10-5-3-4-6-10/h7-8,10H,3-6H2,1-2H3
41 atoms
Cl 3.597971 -2.535481 0.37646
F  -1.367712 -2.569497 1.166962
O  3.07438 0.141078 -0.45762
O  -3.321854 1.372726 0.995255
O  -2.742278 -1.17677 -1.295889
O  -1.34555 1.590773 2.03682
N  -1.696909 0.029831 0.365287
C  3.036625 1.47423 -0.957858
C  4.419938 1.754311 -1.522931
C  2.887019 2.504523 0.168609
C  5.262443 2.034943 -0.281664
C  4.322994 2.833634 0.636321
C  1.946188 -0.457025 -0.067333
C  0.685683 0.126562 -0.071825
C  -0.430376 -0.583281 0.348775
C  2.052479 -1.786763 0.361674
C  -0.29438 -1.893287 0.760598
C  0.943502 -2.504272 0.765896
C  -2.764544 -0.329682 -0.448034
C  -3.840708 0.580728 -0.009699
C  -2.035647 1.056643 1.231454
C  -5.099508 0.709021 -0.431186
C  -6.028012 1.720972 0.160905
C  -5.674779 -0.141119 -1.518354
H  2.253513 1.554699 -1.7209
H  4.359033 2.646358 -2.152399
H  4.791861 0.938397 -2.143188
H  2.253038 2.145953 0.980635
H  2.396296 3.394457 -0.230813
H  6.181574 2.573713 -0.512058
H  5.551864 1.094129 0.188453
H  4.47531 2.582419 1.685028
H  4.511914 3.903585 0.541856
H  0.545655 1.148778 -0.392188
H  1.041891 -3.530156 1.092002
H  -6.407576 2.379169 -0.623549
H  -6.897028 1.219178 0.59166
H  -5.573134 2.335812 0.932217
H  -6.009532 0.493434 -2.341997
H  -4.984309 -0.878315 -1.912405
H  -6.560869 -0.660203 -1.146882
totalener: -1573.88620003 hartree
nucrepener: 2240.44235850 hartree
electener: -3814.32855853 hartree
oneelecener: -6609.44465552 hartree
twoeener: 2795.11609699 hartree
kineticenergy: 1568.73526177 hartree
xcener: -125.344643538011 hartree
chargesum: 0.0000000
charge: -0.053156 -0.195176 -0.296851 -0.243256 -0.342383 -0.306744 -0.124105 0.135031 -0.148639 -0.212209 -0.143123 -0.133329 0.323296 -0.171472 0.006394 -0.030146 0.188661 -0.117519 0.299583 0.077237 0.364030 -0.016845 -0.207335 -0.211338 0.091117 0.076029 0.082112 0.108623 0.086526 0.071871 0.084163 0.076568 0.077398 0.106828 0.115682 0.091478 0.093354 0.106365 0.086493 0.117387 0.087400
qa: -0.0532 -0.1952 -0.2969 -0.2433 -0.3424 -0.3067 -0.1241 0.1350 -0.1486 -0.2122 -0.1431 -0.1333 0.3233 -0.1715 0.0064 -0.0301 0.1887 -0.1175 0.2996 0.0772 0.3640 -0.0168 -0.2073 -0.2113 0.0911 0.0760 0.0821 0.1086 0.0865 0.0719 0.0842 0.0766 0.0774 0.1068 0.1157 0.0915 0.0934 0.1064 0.0865 0.1174 0.0874
va: 1.2615 1.1070 2.1411 2.1905 2.1754 2.2067 3.0933 3.7982 3.9536 3.8843 3.9155 3.8809 3.8911 4.0330 3.7116 3.9533 4.1778 3.9658 4.1995 3.7310 4.4103 3.7601 3.9250 3.9057 1.0015 1.0115 1.0276 1.0132 1.0134 1.0145 1.0195 1.0148 1.0076 1.0245 1.0220 1.0024 1.0029 1.0175 0.9994 1.0330 0.9996
dispcorr: -0.019700765 hartree
energy: -1573.905900797002
dipole: -1.94378 1.30817 -0.63562 27.65794 -26.68342 0.97452 -9.97187 9.19921 -0.77266
magnitude: 1.39668 au
magnitude: 3.55007 debye
