program: Orca
programVersion: 5.0.2
elementType: Cl F F F O O O O N C C C C C C C C C C C C C C C H H H H H H H H H H H
charge: 0
multiplicity: 1
keywords: wb97x-d3
keywords: def2-TZVPP
keywords: def2/J RIJCOSX
keywords: DEFGRID2
keywords: scfconv7
keywords: smallprint printgap noloewdin
keywords: NOSOSCF
formula: C15H11ClF3NO4
InChI: InChI=1/C15H11ClF3NO4/c1-2-23-14-8-10(4-5-12(14)20(21)22)24-13-6-3-9(7-11(13)16)15(17,18)19/h3-8H,2H2,1H3
35 atoms
Cl -1.791892 -0.744573 -2.896655
F  -5.99727 -1.062288 0.181083
F  -4.99313 -2.117193 1.758682
F  -5.524153 -0.052043 2.021137
O  -0.068055 0.568997 -0.984163
O  4.487207 1.641235 -0.485634
O  5.919573 -0.196663 0.641739
O  4.927379 -1.372901 2.114319
N  4.911336 -0.631737 1.152205
C  1.121838 0.253698 -0.410062
C  3.45395 0.849949 -0.231241
C  -1.244058 0.171557 -0.425279
C  2.173474 1.100279 -0.718772
C  3.631576 -0.280421 0.596705
C  -3.734492 -0.527969 0.571464
C  1.29845 -0.866056 0.396409
C  2.55596 -1.109734 0.897816
C  -2.183584 -0.435189 -1.249227
C  -1.552516 0.421013 0.903881
C  -3.431822 -0.77889 -0.758476
C  -2.791663 0.066055 1.403457
C  4.304515 2.82727 -1.267892
C  -5.063439 -0.935882 1.128341
C  5.637263 3.523979 -1.358189
H  1.975333 1.958941 -1.344958
H  0.489348 -1.546314 0.621173
H  2.707215 -1.980281 1.519103
H  -0.82814 0.903768 1.547039
H  -4.147024 -1.245307 -1.421922
H  -3.011538 0.272159 2.442127
H  3.939058 2.560121 -2.262813
H  3.560957 3.472257 -0.792276
H  6.386438 2.89856 -1.843299
H  5.522012 4.428997 -1.953764
H  6.006252 3.815612 -0.375161
elementType: Cl F O N C H
totalener: -1693.66005938 hartree
nucrepener: 2153.71712298 hartree
electener: -3847.37718237 hartree
oneelecener: -6606.78569699 hartree
twoeener: 2759.40851462 hartree
cpcmener: -0.03409185 hartree
kineticenergy: 1688.39538137 hartree
xcener: -131.478571422789 hartree
chargesum: -0.0000000
charge: -0.063121 -0.180643 -0.181612 -0.181928 -0.307430 -0.303783 -0.399075 -0.417418 0.535468 0.243187 0.304830 0.239925 -0.216638 -0.044861 -0.049294 -0.198945 -0.078486 -0.012969 -0.156881 -0.113647 -0.144269 0.044734 0.557806 -0.272636 0.132228 0.161370 0.158229 0.169342 0.132572 0.154595 0.108384 0.108473 0.090048 0.092675 0.089766
qa: -0.0631 -0.1806 -0.1816 -0.1819 -0.3074 -0.3038 -0.3991 -0.4174 0.5355 0.2432 0.3048 0.2399 -0.2166 -0.0449 -0.0493 -0.1989 -0.0785 -0.0130 -0.1569 -0.1136 -0.1443 0.0447 0.5578 -0.2726 0.1322 0.1614 0.1582 0.1693 0.1326 0.1546 0.1084 0.1085 0.0900 0.0927 0.0898
va: 1.2518 1.1221 1.1069 1.1184 2.1167 2.1302 1.8373 1.8326 4.1191 3.8969 4.0703 3.8078 3.9083 3.8430 3.6962 3.9680 4.0014 3.9777 3.9613 4.0347 4.0078 3.7952 4.4156 3.9682 1.0270 0.9960 1.0158 0.9894 1.0271 1.0057 0.9856 0.9861 1.0029 1.0051 1.0030
dispcorr: -0.015479831 hartree
energy: -1693.675539212535
dipole: 39.01134 -40.55774 -1.54641 18.91192 -17.19686 1.71506 -3.36717 2.54818 -0.81900
magnitude: 2.45021 au
magnitude: 6.22795 debye
