program: Orca
programVersion: 5.0.2
elementType: Cl F F F O O O O N C C C C C C C C C C C C C C C H H H H H H H H H H H
charge: 0
multiplicity: 1
keywords: wb97x-d3
keywords: def2-TZVPP
keywords: def2/J RIJCOSX
keywords: DEFGRID2
keywords: scfconv7
keywords: smallprint printgap noloewdin
keywords: NOSOSCF
formula: C15H11ClF3NO4
InChI: InChI=1/C15H11ClF3NO4/c1-2-23-14-8-10(4-5-12(14)20(21)22)24-13-6-3-9(7-11(13)16)15(17,18)19/h3-8H,2H2,1H3
35 atoms
Cl -1.256351 -2.210018 -2.055185
F  -5.115003 0.978928 1.67001
F  -4.48006 2.112079 -0.042675
F  -5.541105 0.261888 -0.311155
O  0.320819 -1.83036 0.357393
O  2.994049 2.076013 -0.398279
O  6.234296 -0.073777 0.280221
O  5.373426 1.841768 0.648695
N  5.277326 0.657402 0.424674
C  1.501634 -1.164353 0.340253
C  2.834252 0.810628 -0.03332
C  -0.853555 -1.142752 0.380727
C  1.597865 0.164774 -0.036452
C  3.965654 0.065466 0.352495
C  -3.307723 0.134775 0.425098
C  2.624992 -1.904463 0.695114
C  3.848938 -1.279734 0.68797
C  -1.722438 -1.264108 -0.695437
C  -1.210846 -0.371986 1.47606
C  -2.956684 -0.635752 -0.673565
C  -2.434003 0.271188 1.497477
C  1.929898 2.800814 -1.023014
C  -4.614053 0.866739 0.435789
C  1.708769 2.38465 -2.459515
H  0.710114 0.700655 -0.341213
H  2.534495 -2.943921 0.978584
H  4.727082 -1.839833 0.976571
H  -0.533013 -0.282005 2.315269
H  -3.621088 -0.749525 -1.51955
H  -2.694781 0.870104 2.359372
H  1.013569 2.730081 -0.431394
H  2.256037 3.838743 -0.977983
H  2.622778 2.493206 -3.04379
H  1.357711 1.357305 -2.557966
H  0.951572 3.033433 -2.90159
elementType: Cl F O N C H
totalener: -1693.66717041 hartree
nucrepener: 2218.33297355 hartree
electener: -3912.00014396 hartree
oneelecener: -6735.62049499 hartree
twoeener: 2823.62035103 hartree
cpcmener: -0.02833727 hartree
kineticenergy: 1688.42030236 hartree
xcener: -131.482593352403 hartree
chargesum: 0.0000000
charge: -0.058953 -0.180153 -0.179768 -0.179062 -0.301337 -0.297472 -0.400336 -0.376428 0.513322 0.261727 0.244585 0.196518 -0.161949 -0.032141 -0.033417 -0.270193 -0.060061 0.019398 -0.135702 -0.135930 -0.149051 0.031371 0.557035 -0.251958 0.143158 0.150134 0.154156 0.164558 0.132213 0.153726 0.090820 0.113774 0.092124 0.089363 0.095931
qa: -0.0590 -0.1802 -0.1798 -0.1791 -0.3013 -0.2975 -0.4003 -0.3764 0.5133 0.2617 0.2446 0.1965 -0.1619 -0.0321 -0.0334 -0.2702 -0.0601 0.0194 -0.1357 -0.1359 -0.1491 0.0314 0.5570 -0.2520 0.1432 0.1501 0.1542 0.1646 0.1322 0.1537 0.0908 0.1138 0.0921 0.0894 0.0959
va: 1.2548 1.1220 1.1093 1.1241 2.1298 2.1372 1.8479 1.8633 4.1388 3.7921 4.0945 3.8590 3.7845 3.8048 3.6925 4.0616 4.0096 3.9669 3.9564 4.0653 4.0051 3.8773 4.4167 3.9189 1.0035 1.0070 1.0130 0.9927 1.0279 1.0066 0.9944 0.9911 1.0055 1.0029 1.0085
dispcorr: -0.016883683 hartree
energy: -1693.684054091743
dipole: 24.27619 -26.55519 -2.27900 7.96277 -8.11204 -0.14927 -2.98664 3.02060 0.03396
magnitude: 2.28413 au
magnitude: 5.80580 debye
