program: Orca
programVersion: 5.0.2
elementType: Cl F F F O O O O N C C C C C C C C C C C C C C C H H H H H H H H H H H
charge: 0
multiplicity: 1
keywords: wb97x-d3
keywords: def2-TZVPP
keywords: def2/J RIJCOSX
keywords: DEFGRID2
keywords: scfconv7
keywords: smallprint printgap noloewdin
keywords: NOSOSCF
formula: C15H11ClF3NO4
InChI: InChI=1/C15H11ClF3NO4/c1-2-23-14-8-10(4-5-12(14)20(21)22)24-13-6-3-9(7-11(13)16)15(17,18)19/h3-8H,2H2,1H3
35 atoms
Cl -1.519432 -1.478885 2.981766
F  -5.474733 0.836896 0.455336
F  -4.767686 1.338644 -1.515066
F  -5.530678 -0.629296 -1.116759
O  0.273201 -1.645571 0.735862
O  3.123857 2.006391 -0.474125
O  6.164942 -0.497475 -0.65248
O  5.318201 1.190734 -1.642307
N  5.220365 0.198332 -0.959594
C  1.452316 -1.13104 0.30387
C  2.8730 0.716764 -0.30353
C  -0.912652 -1.08863 0.388531
C  1.63601 0.230058 0.115979
C  3.914897 -0.211326 -0.504757
C  -3.426936 -0.101857 -0.23165
C  2.483824 -2.04175 0.115811
C  3.714204 -1.566362 -0.275019
C  -1.889141 -0.986758 1.372967
C  -1.200292 -0.691989 -0.909814
C  -3.150148 -0.506392 1.065858
C  -2.452222 -0.195593 -1.217697
C  2.10196 2.9794 -0.244132
C  -4.799014 0.36672 -0.596909
C  2.699826 4.333164 -0.530589
H  0.821905 0.914609 0.3111
H  2.319935 -3.099562 0.268336
H  4.523141 -2.265193 -0.433571
H  -0.451619 -0.780492 -1.686577
H  -3.895271 -0.445986 1.847764
H  -2.656716 0.104749 -2.236625
H  1.248832 2.784423 -0.900561
H  1.756548 2.919958 0.792249
H  3.044801 4.408145 -1.562128
H  1.94112 5.100054 -0.374991
H  3.536023 4.55056 0.13423
elementType: Cl F O N C H
totalener: -1693.66921478 hartree
nucrepener: 2185.47812069 hartree
electener: -3879.14733547 hartree
oneelecener: -6670.01294542 hartree
twoeener: 2790.86560995 hartree
cpcmener: -0.02807579 hartree
kineticenergy: 1688.42829076 hartree
xcener: -131.482796383608 hartree
chargesum: 0.0000000
charge: -0.061136 -0.180070 -0.181298 -0.180176 -0.302564 -0.292267 -0.397537 -0.375898 0.516696 0.247201 0.287200 0.242192 -0.175005 -0.045508 -0.053933 -0.270387 -0.054446 -0.024585 -0.157315 -0.110752 -0.141993 0.038744 0.556733 -0.269441 0.150083 0.151372 0.154060 0.163893 0.132809 0.152684 0.104687 0.104974 0.089913 0.090936 0.090135
qa: -0.0611 -0.1801 -0.1813 -0.1802 -0.3026 -0.2923 -0.3975 -0.3759 0.5167 0.2472 0.2872 0.2422 -0.1750 -0.0455 -0.0539 -0.2704 -0.0544 -0.0246 -0.1573 -0.1108 -0.1420 0.0387 0.5567 -0.2694 0.1501 0.1514 0.1541 0.1639 0.1328 0.1527 0.1047 0.1050 0.0899 0.0909 0.0901
va: 1.2538 1.1231 1.1197 1.1088 2.1252 2.1464 1.8518 1.8633 4.1324 3.8443 4.0722 3.8148 3.8322 3.8169 3.7072 4.0612 3.9919 3.9828 3.9456 4.0329 4.0143 3.8122 4.4167 3.9704 0.9999 1.0060 1.0128 0.9917 1.0274 1.0072 0.9847 0.9849 1.0035 1.0053 1.0032
dispcorr: -0.015877894 hartree
energy: -1693.685092678846
dipole: 28.22457 -30.09969 -1.87512 13.67262 -13.42997 0.24264 -5.57394 5.71808 0.14414
magnitude: 1.89624 au
magnitude: 4.81986 debye
