program: Orca
programVersion: 5.0.2
elementType: Cl Cl O O O N N C C C C C C C C C C C C C C C H H H H H H H H H H H H H H H H H H
charge: 0
multiplicity: 1
keywords: wb97x-d3
keywords: def2-TZVPP
keywords: def2/J RIJCOSX
keywords: DEFGRID2
keywords: scfconv7
keywords: smallprint printgap noloewdin
keywords: NOSOSCF
formula: C15H18Cl2N2O3
InChI: InChI=1/C15H18Cl2N2O3/c1-8(2)21-12-7-11(9(16)6-10(12)17)19-14(20)22-13(18-19)15(3,4)5/h6-8H,1-5H3
40 atoms
Cl -0.4579 -3.087489 0.059783
Cl 4.403512 -1.081347 1.07382
O  -3.187164 -0.050218 -1.169794
O  3.065667 1.543027 0.739715
O  -1.592758 -1.211492 -2.293739
N  -1.275721 -0.208243 -0.215791
N  -2.050389 0.579112 0.595568
C  -4.417032 1.342202 0.436547
C  -3.177055 0.641428 -0.000229
C  -5.495071 0.291644 0.730201
C  -4.886917 2.277559 -0.683074
C  -4.121405 2.14967 1.697289
C  0.080114 -0.43328 0.067889
C  -1.944643 -0.579546 -1.333676
C  0.924932 0.652649 0.236523
C  2.26517 0.475018 0.540641
C  3.882579 1.955387 -0.38718
C  0.581982 -1.723322 0.198019
C  2.751535 -0.828138 0.657554
C  1.922112 -1.922068 0.486797
C  3.035371 2.591881 -1.469563
C  4.91792 2.903819 0.171646
H  -5.741321 -0.300808 -0.151301
H  -5.180427 -0.388104 1.523166
H  -6.406823 0.792011 1.058347
H  -5.152765 1.734756 -1.590282
H  -4.122934 3.014333 -0.934884
H  -5.774655 2.816064 -0.350057
H  -5.033782 2.652086 2.01935
H  -3.365395 2.91522 1.520674
H  -3.783426 1.517616 2.518596
H  0.533835 1.657164 0.138582
H  4.385487 1.07342 -0.796886
H  2.31216 -2.92456 0.595979
H  3.680272 2.912841 -2.288244
H  2.307304 1.896645 -1.889023
H  2.504944 3.468532 -1.094527
H  5.523351 2.424369 0.941287
H  4.451758 3.793631 0.597871
H  5.587017 3.22691 -0.625254
elementType: Cl O N C H
totalener: -1838.13769414 hartree
nucrepener: 2143.82766934 hartree
electener: -3981.96536348 hartree
oneelecener: -6782.40119153 hartree
twoeener: 2800.43582804 hartree
cpcmener: -0.02873265 hartree
kineticenergy: 1832.91171861 hartree
xcener: -130.254550591221 hartree
chargesum: -0.0000000
charge: -0.056832 -0.066965 -0.251900 -0.376230 -0.465770 0.040002 -0.290161 0.214299 0.235773 -0.320498 -0.324121 -0.322205 0.176774 0.410553 -0.202105 0.235622 0.147331 -0.064502 0.008689 -0.081408 -0.276486 -0.243090 0.106907 0.108438 0.103313 0.104964 0.110075 0.103009 0.106107 0.106737 0.101993 0.151907 0.070349 0.130399 0.103212 0.101185 0.091939 0.091861 0.089491 0.091342
qa: -0.0568 -0.0670 -0.2519 -0.3762 -0.4658 0.0400 -0.2902 0.2143 0.2358 -0.3205 -0.3241 -0.3222 0.1768 0.4106 -0.2021 0.2356 0.1473 -0.0645 0.0087 -0.0814 -0.2765 -0.2431 0.1069 0.1084 0.1033 0.1050 0.1101 0.1030 0.1061 0.1067 0.1020 0.1519 0.0703 0.1304 0.1032 0.1012 0.0919 0.0919 0.0895 0.0913
va: 1.2621 1.2457 2.2305 2.0001 2.0503 3.1529 2.9123 3.8304 4.0927 3.9261 3.9285 3.9205 3.6126 4.3934 4.0328 3.9311 3.8098 4.0668 3.9722 4.0176 3.8948 3.9124 1.0076 1.0045 1.0016 1.0090 1.0035 1.0010 1.0013 1.0070 1.0083 1.0111 1.0069 1.0186 1.0077 1.0028 1.0088 1.0116 1.0079 1.0066
dispcorr: -0.020032416 hartree
energy: -1838.157726557618
dipole: -18.13621 17.67582 -0.46039 35.38886 -33.56691 1.82195 -1.23892 1.76657 0.52766
magnitude: 1.95189 au
magnitude: 4.96131 debye
