program: Orca
programVersion: 5.0.2
elementType: Cl Cl O O O N N C C C C C C C C C C C C C C C H H H H H H H H H H H H H H H H H H
charge: 0
multiplicity: 1
keywords: wb97x-d3
keywords: def2-TZVPP
keywords: def2/J RIJCOSX
keywords: DEFGRID2
keywords: scfconv7
keywords: smallprint printgap noloewdin
keywords: NOSOSCF
formula: C15H18Cl2N2O3
InChI: InChI=1/C15H18Cl2N2O3/c1-8(2)21-12-7-11(9(16)6-10(12)17)19-14(20)22-13(18-19)15(3,4)5/h6-8H,1-5H3
40 atoms
Cl -0.494789 -3.244593 0.210396
Cl 4.522219 -1.372411 0.370503
O  -3.238246 -0.152619 -1.040178
O  3.314123 1.192562 0.015756
O  -1.896555 -1.644628 -2.114501
N  -1.234306 -0.351977 -0.288459
N  -1.827082 0.650735 0.431037
C  -4.114726 1.621504 0.408596
C  -3.009129 0.722482 -0.037877
C  -3.572541 2.612067 1.437042
C  -5.219564 0.763723 1.041449
C  -4.674168 2.376988 -0.803002
C  0.130708 -0.629344 -0.136247
C  -2.070646 -0.840702 -1.256333
C  1.025916 0.433114 -0.159082
C  2.38668 0.232451 0.015867
C  2.935896 2.567684 0.026958
C  0.590889 -1.921725 0.063213
C  2.838854 -1.083686 0.178283
C  1.95455 -2.141815 0.198706
C  2.370095 2.971071 1.37982
C  4.189085 3.347407 -0.318387
H  -2.78903 3.241477 1.015484
H  -4.380028 3.262422 1.774382
H  -3.160056 2.106293 2.309075
H  -5.628131 0.03956 0.33673
H  -6.03863 1.403949 1.37183
H  -4.848421 0.221115 1.911509
H  -5.099819 1.703133 -1.545917
H  -3.904958 2.977007 -1.29109
H  -5.465138 3.053853 -0.478009
H  0.621397 1.42379 -0.30769
H  2.190837 2.74775 -0.758615
H  2.325247 -3.146156 0.345139
H  3.115806 2.828034 2.162545
H  2.093955 4.02574 1.366979
H  1.48088 2.404165 1.655311
H  3.964173 4.412756 -0.36136
H  4.587496 3.046861 -1.286619
H  4.963707 3.195593 0.433763
totalener: -1838.12994500 hartree
nucrepener: 2148.43369381 hartree
electener: -3986.56363882 hartree
oneelecener: -6791.40053242 hartree
twoeener: 2804.83689361 hartree
kineticenergy: 1832.97429696 hartree
xcener: -130.265196972265 hartree
chargesum: -0.0000000
charge: -0.047497 -0.055063 -0.241866 -0.283277 -0.313979 0.014470 -0.270537 0.154267 0.208394 -0.285389 -0.304196 -0.299585 0.130618 0.328160 -0.195595 0.326362 0.111962 -0.081342 -0.055795 -0.061754 -0.246720 -0.236406 0.095190 0.093248 0.103344 0.108857 0.090722 0.104113 0.109498 0.097010 0.090482 0.103868 0.056811 0.109124 0.091757 0.085548 0.099706 0.077941 0.097474 0.090075
qa: -0.0475 -0.0551 -0.2419 -0.2833 -0.3140 0.0145 -0.2705 0.1543 0.2084 -0.2854 -0.3042 -0.2996 0.1306 0.3282 -0.1956 0.3264 0.1120 -0.0813 -0.0558 -0.0618 -0.2467 -0.2364 0.0952 0.0932 0.1033 0.1089 0.0907 0.1041 0.1095 0.0970 0.0905 0.1039 0.0568 0.1091 0.0918 0.0855 0.0997 0.0779 0.0975 0.0901
va: 1.2687 1.2586 2.2262 2.1407 2.2112 3.1185 2.8824 3.9275 4.0742 3.9276 3.9262 3.9285 3.7838 4.4444 3.9715 3.8709 3.8941 4.0811 3.9909 4.0055 3.8948 3.9323 1.0119 1.0040 1.0121 1.0097 1.0044 1.0075 1.0112 1.0072 1.0045 1.0340 0.9983 1.0265 1.0094 1.0103 1.0091 1.0066 1.0112 1.0100
dispcorr: -0.019603288 hartree
energy: -1838.149548292793
dipole: -20.58858 20.07666 -0.51192 42.62266 -40.50359 2.11907 7.06246 -6.25196 0.81050
magnitude: 2.32582 au
magnitude: 5.91177 debye
