program: Orca
programVersion: 5.0.2
elementType: Cl Cl O O O N N C C C C C C C C C C C C C C C H H H H H H H H H H H H H H
charge: 0
multiplicity: 1
keywords: wb97x-d3
keywords: def2-TZVPP
keywords: def2/J RIJCOSX
keywords: DEFGRID2
keywords: scfconv7
keywords: smallprint printgap noloewdin
keywords: NOSOSCF
formula: C15H14Cl2N2O3
InChI: InChI=1/C15H14Cl2N2O3/c1-5-6-21-12-8-11(9(16)7-10(12)17)19-14(20)22-13(18-19)15(2,3)4/h1,7-8H,6H2,2-4H3
36 atoms
Cl 0.461873 -2.946807 -0.083161
Cl -4.633058 -1.394134 -0.66532
O  2.792945 0.588822 1.427109
O  0.875228 0.806305 2.635951
O  -3.661966 1.199783 0.023144
N  0.978468 -0.035335 0.466073
N  1.987058 -0.248364 -0.433789
C  4.442601 0.120316 -0.327188
C  3.037071 0.133291 0.175598
C  4.451211 -0.36825 -1.774101
C  5.270572 -0.828761 0.549086
C  5.022969 1.538163 -0.24655
C  -0.352136 -0.378878 0.190249
C  1.445168 0.486613 1.639384
C  -1.32226 0.61377 0.226393
C  -0.708106 -1.688388 -0.097796
C  -2.654166 0.315344 -0.01765
C  -2.031284 -1.991872 -0.376144
C  -2.99387 -1.003172 -0.33469
C  -3.393004 2.537135 0.374665
C  -2.705503 3.277061 -0.678777
C  -2.141788 3.888285 -1.542413
H  3.875616 0.288767 -2.425688
H  5.477462 -0.393243 -2.141899
H  4.035611 -1.371259 -1.864394
H  4.878723 -1.845908 0.511153
H  5.291158 -0.510449 1.59132
H  6.300212 -0.854451 0.189974
H  5.045706 1.914528 0.775914
H  4.450029 2.239281 -0.854892
H  6.047395 1.535543 -0.620745
H  -1.002437 1.624957 0.43297
H  -2.315919 -3.008236 -0.607417
H  -4.368272 2.987938 0.560883
H  -2.826536 2.596321 1.311698
H  -1.648583 4.428228 -2.314722
totalener: -1835.62596224 hartree
nucrepener: 2070.35189353 hartree
electener: -3905.97785576 hartree
oneelecener: -6632.46782126 hartree
twoeener: 2726.48996550 hartree
kineticenergy: 1830.57880307 hartree
xcener: -129.387380061744 hartree
chargesum: -0.0000000
charge: -0.051898 -0.049210 -0.242750 -0.335667 -0.270297 -0.001523 -0.242852 0.156762 0.200720 -0.282992 -0.305933 -0.302430 0.113281 0.335313 -0.137406 -0.072185 0.318211 -0.071373 -0.036759 -0.020663 -0.399058 0.083485 0.099088 0.091206 0.103209 0.102847 0.107929 0.090222 0.107772 0.098314 0.090705 0.107011 0.108628 0.123155 0.138525 0.246613
qa: -0.0519 -0.0492 -0.2427 -0.3357 -0.2703 -0.0015 -0.2429 0.1568 0.2007 -0.2830 -0.3059 -0.3024 0.1133 0.3353 -0.1374 -0.0722 0.3182 -0.0714 -0.0368 -0.0207 -0.3991 0.0835 0.0991 0.0912 0.1032 0.1028 0.1079 0.0902 0.1078 0.0983 0.0907 0.1070 0.1086 0.1232 0.1385 0.2466
va: 1.2631 1.2623 2.2243 2.1953 2.1408 3.1403 2.8701 3.9301 4.0749 3.9309 3.9294 3.9249 3.7975 4.4356 3.9896 4.1046 3.8664 4.0240 3.9857 3.9857 3.7337 3.7116 1.0122 1.0033 1.0120 1.0077 1.0100 1.0047 1.0107 1.0076 1.0047 1.0273 1.0277 0.9873 0.9808 0.9710
dispcorr: -0.017776327 hartree
energy: -1835.643738563764
dipole: 37.05475 -36.20612 0.84863 15.72395 -15.02803 0.69592 -4.26541 3.45342 -0.81199
magnitude: 1.36521 au
magnitude: 3.47010 debye
