program: Orca
programVersion: 5.0.2
elementType: Cl F F F O O O O O O O N C C C C C C C C C C C C C C C C C C C H H H H H H H H H H H H H H H
charge: 0
multiplicity: 1
keywords: wb97x-d3
keywords: def2-TZVPP
keywords: def2/J RIJCOSX
keywords: DEFGRID2
keywords: scfconv7
keywords: smallprint printgap noloewdin
keywords: NOSOSCF
formula: C19H15ClF3NO7
InChI: InChI=1/C19H15ClF3NO7/c1-3-29-17(25)10(2)30-18(26)13-9-12(5-6-15(13)24(27)28)31-16-7-4-11(8-14(16)20)19(21,22)23/h4-10H,3H2,1-2H3
46 atoms
Cl -0.406496 2.498889 -2.35387
F  -4.434762 -0.548968 0.447557
F  -5.439312 1.241279 1.086943
F  -5.177118 0.84438 -1.010162
O  1.858915 -1.754046 0.996766
O  0.474053 3.230003 0.361947
O  -0.768984 -3.956916 0.094087
O  2.515237 -1.750552 -1.149953
O  -0.524178 -1.751201 -0.147728
O  4.956474 -1.072462 0.290719
O  6.06188 0.622932 -0.393427
N  5.038229 0.093814 -0.02955
C  2.598308 0.264108 0.111276
C  1.239132 -3.034686 0.883226
C  1.560324 2.423243 0.260657
C  3.836356 0.889808 0.034571
C  1.45965 1.037627 0.241906
C  2.801352 3.044571 0.180924
C  2.362072 -1.199354 -0.093375
C  -0.769023 2.653371 0.310914
C  3.939932 2.273697 0.072994
C  -3.264881 1.469415 0.216874
C  1.107875 -3.601689 2.282933
C  -1.307188 2.257065 -0.908274
C  -1.485867 2.470174 1.478866
C  -0.113166 -2.825655 0.21597
C  -2.553437 1.658523 -0.959698
C  -2.7385 1.882593 1.434038
C  -4.582457 0.757583 0.182245
C  -2.088704 -3.912291 -0.493655
C  -2.656466 -5.306058 -0.453637
H  1.843252 -3.705956 0.266725
H  0.49768 0.547998 0.303772
H  2.874934 4.123226 0.209376
H  4.904858 2.758463 0.033066
H  2.092962 -3.680838 2.740293
H  0.68202 -4.601701 2.243929
H  0.475272 -2.978468 2.914342
H  -1.059608 2.784229 2.422233
H  -2.947313 1.3419 -1.915694
H  -3.283431 1.74232 2.357433
H  -2.011244 -3.54668 -1.518979
H  -2.712145 -3.216795 0.071477
H  -3.65461 -5.290546 -0.890704
H  -2.746209 -5.676286 0.56758
H  -2.051687 -6.006284 -1.029677
elementType: Cl F O N C H
totalener: -2074.25496743 hartree
nucrepener: 3420.07169570 hartree
electener: -5494.32666313 hartree
oneelecener: -9654.25819732 hartree
twoeener: 4159.93153419 hartree
cpcmener: -0.04302842 hartree
kineticenergy: 2067.52883635 hartree
xcener: -165.653302293294 hartree
chargesum: -0.0000000
charge: -0.053867 -0.177393 -0.180051 -0.179529 -0.267303 -0.302130 -0.288881 -0.423916 -0.469282 -0.393273 -0.394489 0.565103 0.040176 0.188142 0.257344 -0.035929 -0.151396 -0.210093 0.419758 0.203330 -0.046029 -0.022901 -0.275906 0.052326 -0.126976 0.436591 -0.158765 -0.156256 0.556354 0.041770 -0.249461 0.111842 0.146003 0.154328 0.160520 0.105930 0.101377 0.107241 0.158687 0.134703 0.155570 0.103531 0.092856 0.090398 0.089463 0.090483
qa: -0.0539 -0.1774 -0.1801 -0.1795 -0.2673 -0.3021 -0.2889 -0.4239 -0.4693 -0.3933 -0.3945 0.5651 0.0402 0.1881 0.2573 -0.0359 -0.1514 -0.2101 0.4198 0.2033 -0.0460 -0.0229 -0.2759 0.0523 -0.1270 0.4366 -0.1588 -0.1563 0.5564 0.0418 -0.2495 0.1118 0.1460 0.1543 0.1605 0.1059 0.1014 0.1072 0.1587 0.1347 0.1556 0.1035 0.0929 0.0904 0.0895 0.0905
va: 1.2623 1.1059 1.1217 1.1241 2.1567 2.1324 2.1750 2.0733 2.0089 1.8547 1.8664 4.0774 3.8744 3.7977 3.7987 3.8484 3.9416 4.0744 4.2555 3.8141 4.0079 3.6831 3.9714 3.9645 3.9670 4.0423 4.0869 4.0066 4.4024 3.8456 3.9743 1.0224 1.0345 1.0055 1.0099 1.0052 1.0139 1.0012 0.9984 1.0265 1.0053 0.9945 0.9989 1.0062 1.0030 1.0031
dispcorr: -0.024944465 hartree
energy: -2074.279911899838
dipole: 8.33127 -10.69626 -2.36499 -29.33990 29.62243 0.28253 10.99791 -8.99784 2.00007
magnitude: 3.11019 au
magnitude: 7.90547 debye
