program: Orca
programVersion: 5.0.2
elementType: Cl F F F O O O O O O O N C C C C C C C C C C C C C C C C C C C H H H H H H H H H H H H H H H
charge: 0
multiplicity: 1
keywords: wb97x-d3
keywords: def2-TZVPP
keywords: def2/J RIJCOSX
keywords: DEFGRID2
keywords: scfconv7
keywords: smallprint printgap noloewdin
keywords: NOSOSCF
formula: C19H15ClF3NO7
InChI: InChI=1/C19H15ClF3NO7/c1-3-29-17(25)10(2)30-18(26)13-9-12(5-6-15(13)24(27)28)31-16-7-4-11(8-14(16)20)19(21,22)23/h4-10H,3H2,1-2H3
46 atoms
Cl -0.380448 2.689177 -2.151433
F  -5.59099 1.555671 -0.807048
F  -4.647626 -0.331592 -1.21368
F  -5.331154 0.122955 0.772978
O  2.199507 -2.010731 0.80103
O  0.295347 2.942571 0.707252
O  -0.245888 -2.33798 0.124599
O  2.365487 -1.736827 -1.421133
O  -0.174089 -4.576799 0.124726
O  4.95254 -1.081212 -0.163428
O  5.982055 0.762981 -0.477898
N  4.982498 0.128753 -0.238539
C  2.54829 0.148158 0.017827
C  1.812877 -3.38026 0.669857
C  1.412258 2.211611 0.467139
C  3.749998 0.843551 -0.014162
C  1.375726 0.836942 0.267683
C  2.618885 2.902383 0.442475
C  2.400871 -1.307438 -0.299746
C  -0.927259 2.371538 0.470081
C  3.788285 2.214913 0.201734
C  -3.407549 1.247569 -0.002841
C  2.05519 -4.050798 2.007852
C  -1.376719 2.199442 -0.836321
C  -1.721756 1.988813 1.533073
C  0.349742 -3.499381 0.269316
C  -2.614259 1.63611 -1.076253
C  -2.969395 1.430483 1.299743
C  -4.745303 0.646488 -0.303925
C  -1.655517 -2.292111 -0.182413
C  -2.484796 -2.361234 1.076381
H  2.411018 -3.873555 -0.100985
H  0.439097 0.296029 0.298512
H  2.639217 3.970625 0.609477
H  4.725683 2.751909 0.190531
H  3.105556 -3.96669 2.281518
H  1.81504 -5.109204 1.938009
H  1.448145 -3.609062 2.797472
H  -1.363098 2.126399 2.544429
H  -2.946819 1.504401 -2.097779
H  -3.575999 1.137472 2.144797
H  -1.91342 -3.086063 -0.88311
H  -1.790619 -1.337853 -0.687987
H  -3.538916 -2.277222 0.813301
H  -2.241584 -1.545912 1.757786
H  -2.351123 -3.306852 1.60144
elementType: Cl F O N C H
totalener: -2074.25465407 hartree
nucrepener: 3469.59714632 hartree
electener: -5543.85180039 hartree
oneelecener: -9750.73958927 hartree
twoeener: 4206.88778888 hartree
cpcmener: -0.04660060 hartree
kineticenergy: 2067.54355594 hartree
xcener: -165.657891754355 hartree
chargesum: -0.0000000
charge: -0.053078 -0.181145 -0.185443 -0.182334 -0.264405 -0.301497 -0.261214 -0.424207 -0.478539 -0.395904 -0.395054 0.574009 0.035150 0.157354 0.208793 -0.028038 -0.116704 -0.191502 0.438224 0.201188 -0.062104 -0.038267 -0.266706 0.060824 -0.111271 0.416354 -0.162126 -0.178656 0.588652 0.030678 -0.285962 0.110333 0.143347 0.154740 0.160757 0.106667 0.099708 0.108525 0.158961 0.132008 0.155986 0.113271 0.102531 0.100061 0.097875 0.108159
qa: -0.0531 -0.1811 -0.1854 -0.1823 -0.2644 -0.3015 -0.2612 -0.4242 -0.4785 -0.3959 -0.3951 0.5740 0.0351 0.1574 0.2088 -0.0280 -0.1167 -0.1915 0.4382 0.2012 -0.0621 -0.0383 -0.2667 0.0608 -0.1113 0.4164 -0.1621 -0.1787 0.5887 0.0307 -0.2860 0.1103 0.1433 0.1547 0.1608 0.1067 0.0997 0.1085 0.1590 0.1320 0.1560 0.1133 0.1025 0.1001 0.0979 0.1082
va: 1.2630 1.1158 1.1097 1.1213 2.1523 2.1302 2.1435 2.0752 2.0332 1.8512 1.8690 4.0798 3.8772 3.8235 3.8032 3.8673 3.9239 4.0496 4.2353 3.8007 4.0277 3.6138 3.9582 3.9503 3.9435 4.1107 4.0728 3.9196 4.3683 3.7906 3.9235 1.0211 1.0184 1.0054 1.0115 1.0065 1.0170 1.0020 0.9978 1.0283 1.0060 1.0139 1.0020 1.0180 0.9975 1.0149
dispcorr: -0.028511670 hartree
energy: -2074.283165741705
dipole: 12.12020 -14.14176 -2.02156 -20.79651 22.98906 2.19256 16.92396 -14.56830 2.35567
magnitude: 3.80042 au
magnitude: 9.65990 debye
