program: Orca
programVersion: 5.0.2
elementType: Cl F F F O O O O O O O N C C C C C C C C C C C C C C C C C C C H H H H H H H H H H H H H H H
charge: 0
multiplicity: 1
keywords: wb97x-d3
keywords: def2-TZVPP
keywords: def2/J RIJCOSX
keywords: DEFGRID2
keywords: scfconv7
keywords: smallprint printgap noloewdin
keywords: NOSOSCF
formula: C19H15ClF3NO7
InChI: InChI=1/C19H15ClF3NO7/c1-3-29-17(25)10(2)30-18(26)13-9-12(5-6-15(13)24(27)28)31-16-7-4-11(8-14(16)20)19(21,22)23/h4-10H,3H2,1-2H3
46 atoms
Cl -0.33473 2.748119 -2.200024
F  -5.613756 0.953877 0.677959
F  -5.734123 2.691767 -0.579511
F  -5.159984 0.801739 -1.419967
O  2.266492 -2.003949 0.880848
O  0.309975 3.07254 0.668762
O  0.291086 -4.827016 0.067252
O  1.958074 -1.743965 -1.325398
O  -0.30326 -2.718685 0.547938
O  4.741793 -1.176853 -0.3523
O  5.927424 0.582414 -0.12735
N  4.861926 0.014026 -0.155817
C  2.421239 0.155351 0.031732
C  1.994913 -3.401484 0.788299
C  1.379317 2.269769 0.457269
C  3.661152 0.783026 0.062213
C  1.273814 0.901675 0.234308
C  2.623136 2.892052 0.496508
C  2.22401 -1.303236 -0.239219
C  -0.960281 2.629615 0.419221
C  3.763724 2.147809 0.298653
C  -3.585586 1.901451 -0.061782
C  2.316634 -4.013753 2.13876
C  -1.410173 2.465327 -0.88698
C  -1.82171 2.420837 1.480197
C  0.525874 -3.588848 0.447103
C  -2.72088 2.098386 -1.131095
C  -3.13907 2.064932 1.242504
C  -5.022316 1.580631 -0.342333
C  -1.070807 -5.225291 -0.195581
C  -1.822585 -5.533566 1.07694
H  2.618275 -3.857338 0.014766
H  0.310746 0.405786 0.224995
H  2.691709 3.956381 0.675446
H  4.726247 2.637422 0.323481
H  1.692111 -3.596205 2.928197
H  3.362604 -3.839595 2.386988
H  2.158683 -5.089886 2.106294
H  -1.463316 2.55338 2.492254
H  -3.052518 1.980114 -2.154018
H  -3.799744 1.918389 2.085392
H  -0.975352 -6.115499 -0.813528
H  -1.573167 -4.458837 -0.786403
H  -1.318587 -6.305004 1.658948
H  -2.813159 -5.907503 0.817149
H  -1.95586 -4.653273 1.704428
elementType: Cl F O N C H
totalener: -2074.25584494 hartree
nucrepener: 3331.98406504 hartree
electener: -5406.23990999 hartree
oneelecener: -9478.09750957 hartree
twoeener: 4071.85759959 hartree
cpcmener: -0.04383649 hartree
kineticenergy: 2067.52620678 hartree
xcener: -165.654179383643 hartree
chargesum: 0.0000000
charge: -0.054061 -0.179295 -0.180610 -0.180861 -0.260402 -0.295669 -0.286790 -0.428905 -0.470777 -0.398234 -0.397493 0.579913 0.042052 0.159776 0.208072 -0.022955 -0.121169 -0.183446 0.442671 0.212806 -0.077924 -0.032835 -0.276812 0.036720 -0.157221 0.413691 -0.137196 -0.137884 0.555584 0.038921 -0.253699 0.118628 0.149801 0.155061 0.161420 0.108322 0.107632 0.103860 0.158938 0.136075 0.156268 0.113387 0.095286 0.090362 0.098844 0.090148
qa: -0.0541 -0.1793 -0.1806 -0.1809 -0.2604 -0.2957 -0.2868 -0.4289 -0.4708 -0.3982 -0.3975 0.5799 0.0421 0.1598 0.2081 -0.0230 -0.1212 -0.1834 0.4427 0.2128 -0.0779 -0.0328 -0.2768 0.0367 -0.1572 0.4137 -0.1372 -0.1379 0.5556 0.0389 -0.2537 0.1186 0.1498 0.1551 0.1614 0.1083 0.1076 0.1039 0.1589 0.1361 0.1563 0.1134 0.0953 0.0904 0.0988 0.0901
va: 1.2610 1.1242 1.1084 1.1209 2.1513 2.1329 2.1613 2.0717 2.0146 1.8467 1.8668 4.0908 3.8497 3.8165 3.7966 3.9014 3.9189 4.0395 4.2211 3.7891 4.0423 3.6910 3.9582 3.9777 3.9979 4.0863 4.0881 3.9809 4.4170 3.8408 3.9214 1.0216 1.0108 1.0051 1.0138 1.0030 1.0051 1.0125 0.9996 1.0259 1.0048 0.9962 1.0090 1.0043 1.0067 1.0117
dispcorr: -0.023787224 hartree
energy: -2074.279632168369
dipole: 16.70077 -17.97264 -1.27187 -36.98710 36.93661 -0.05049 17.21678 -15.13817 2.07861
magnitude: 2.43738 au
magnitude: 6.19532 debye
