program: Orca
programVersion: 5.0.2
elementType: Cl F F F O O O O O O O N C C C C C C C C C C C C C C C C C C C H H H H H H H H H H H H H H H
charge: 0
multiplicity: 1
keywords: wb97x-d3
keywords: def2-TZVPP
keywords: def2/J RIJCOSX
keywords: DEFGRID2
keywords: scfconv7
keywords: smallprint printgap noloewdin
keywords: NOSOSCF
formula: C19H15ClF3NO7
InChI: InChI=1/C19H15ClF3NO7/c1-3-29-17(25)10(2)30-18(26)13-9-12(5-6-15(13)24(27)28)31-16-7-4-11(8-14(16)20)19(21,22)23/h4-10H,3H2,1-2H3
46 atoms
Cl -3.019634 0.456334 2.399951
F  -5.137915 4.681247 -1.708967
F  -6.14843 3.977273 0.053704
F  -4.608329 5.466519 0.219599
O  3.543399 -2.486852 0.171499
O  -1.151553 0.249828 0.20429
O  1.869473 -4.422833 0.075199
O  2.884563 -2.381073 -1.971466
O  3.39684 -6.013156 -0.301723
O  4.914611 -0.265794 -0.924381
O  4.909515 1.657417 0.001299
N  4.347999 0.660061 -0.384186
C  2.271559 -0.64758 -0.461254
C  4.146389 -3.767554 -0.015858
C  0.185124 0.418268 0.059382
C  2.918961 0.557881 -0.204755
C  0.897744 -0.709333 -0.333781
C  0.83636 1.615963 0.327294
C  2.959021 -1.914015 -0.866825
C  -2.01357 1.293466 0.046579
C  2.208069 1.681272 0.188999
C  -3.928734 3.268921 -0.270095
C  5.074305 -4.008384 1.158573
C  -2.997311 1.474506 1.011863
C  -1.981053 2.114541 -1.069346
C  3.094344 -4.861379 -0.102718
C  -3.962014 2.453607 0.853156
C  -2.933109 3.105778 -1.224603
C  -4.956705 4.345674 -0.428462
C  0.77967 -5.364151 -0.005851
C  -0.504974 -4.577809 0.027209
H  4.721035 -3.784805 -0.945917
H  0.369513 -1.635501 -0.525007
H  0.293999 2.495666 0.645916
H  2.713447 2.614973 0.388483
H  5.829528 -3.225004 1.200881
H  5.588923 -4.958352 1.031756
H  4.53379 -4.029585 2.104364
H  -1.222601 1.972757 -1.828357
H  -4.723961 2.570559 1.612291
H  -2.89079 3.731484 -2.104903
H  0.844646 -6.054234 0.836631
H  0.862285 -5.939696 -0.928488
H  -0.603306 -3.997803 0.94455
H  -1.343643 -5.271923 -0.019126
H  -0.583886 -3.903737 -0.825826
elementType: Cl F O N C H
totalener: -2074.25534631 hartree
nucrepener: 3235.96194918 hartree
electener: -5310.21729548 hartree
oneelecener: -9283.86697898 hartree
twoeener: 3973.64968350 hartree
cpcmener: -0.04664945 hartree
kineticenergy: 2067.52767199 hartree
xcener: -165.653370541014 hartree
chargesum: 0.0000000
charge: -0.061074 -0.180609 -0.181773 -0.181509 -0.264294 -0.305461 -0.263267 -0.428868 -0.479187 -0.394339 -0.393928 0.575185 0.073770 0.150140 0.260628 -0.033070 -0.216029 -0.142982 0.440140 0.236741 -0.077011 -0.048306 -0.262850 -0.019612 -0.150435 0.421429 -0.121737 -0.133670 0.558448 0.035349 -0.275139 0.112074 0.152044 0.166275 0.161767 0.105514 0.100062 0.108836 0.169394 0.132706 0.155317 0.108397 0.098862 0.093827 0.104947 0.093300
qa: -0.0611 -0.1806 -0.1818 -0.1815 -0.2643 -0.3055 -0.2633 -0.4289 -0.4792 -0.3943 -0.3939 0.5752 0.0738 0.1501 0.2606 -0.0331 -0.2160 -0.1430 0.4401 0.2367 -0.0770 -0.0483 -0.2629 -0.0196 -0.1504 0.4214 -0.1217 -0.1337 0.5584 0.0353 -0.2751 0.1121 0.1520 0.1663 0.1618 0.1055 0.1001 0.1088 0.1694 0.1327 0.1553 0.1084 0.0989 0.0938 0.1049 0.0933
va: 1.2538 1.1215 1.1194 1.1073 2.1341 2.1207 2.1598 2.0734 2.0356 1.8508 1.8688 4.0832 3.8192 3.8309 3.8612 3.9093 4.1064 3.9569 4.2185 3.8001 4.0209 3.6957 3.9596 3.9850 3.9608 4.1147 4.0557 3.9851 4.4151 3.8394 3.9642 1.0214 1.0138 0.9931 1.0155 1.0070 1.0164 1.0017 0.9895 1.0270 1.0056 0.9934 0.9983 1.0020 1.0074 1.0000
dispcorr: -0.023727856 hartree
energy: -2074.279074163299
dipole: 32.22574 -34.27470 -2.04896 -41.56574 42.46809 0.90235 -0.32193 1.28980 0.96787
magnitude: 2.43911 au
magnitude: 6.19972 debye
