program: Orca
programVersion: 5.0.2
elementType: Cl F F F O O O O O O O N C C C C C C C C C C C C C C C C C C C H H H H H H H H H H H H H H H
charge: 0
multiplicity: 1
keywords: wb97x-d3
keywords: def2-TZVPP
keywords: def2/J RIJCOSX
keywords: DEFGRID2
keywords: scfconv7
keywords: smallprint printgap noloewdin
keywords: NOSOSCF
formula: C19H15ClF3NO7
InChI: InChI=1/C19H15ClF3NO7/c1-3-29-17(25)10(2)30-18(26)13-9-12(5-6-15(13)24(27)28)31-16-7-4-11(8-14(16)20)19(21,22)23/h4-10H,3H2,1-2H3
46 atoms
Cl -0.505966 2.597931 -2.231881
F  -5.383763 1.149902 -1.136652
F  -5.224001 0.260963 0.816198
F  -5.78911 2.32216 0.619503
O  2.182951 -1.924009 1.034564
O  0.349657 3.109518 0.545873
O  0.17674 -4.675954 0.090389
O  2.124616 -1.819414 -1.203372
O  -0.385183 -2.54466 0.495508
O  4.81137 -1.173173 -0.105436
O  5.935267 0.613761 -0.423392
N  4.901145 0.033164 -0.195129
C  2.468403 0.169756 0.055779
C  1.840068 -3.309874 1.004962
C  1.418798 2.302712 0.349899
C  3.699258 0.809748 -0.017214
C  1.320857 0.920147 0.243324
C  2.654479 2.93831 0.279839
C  2.277079 -1.303185 -0.128412
C  -0.922471 2.619786 0.428022
C  3.795004 2.190487 0.095774
C  -3.547462 1.787546 0.201863
C  1.93976 -3.829872 2.4264
C  -1.467316 2.365752 -0.823962
C  -1.687223 2.444853 1.568336
C  0.418271 -3.44441 0.484682
C  -2.782463 1.947077 -0.942735
C  -3.002515 2.035101 1.457041
C  -4.984643 1.376677 0.115951
C  -1.150755 -5.005726 -0.371909
C  -1.385549 -4.556969 -1.79454
H  2.529741 -3.855572 0.356641
H  0.362849 0.418309 0.304658
H  2.716724 4.014239 0.369333
H  4.752575 2.687919 0.044815
H  2.953404 -3.699858 2.802697
H  1.711006 -4.893578 2.448716
H  1.247152 -3.313491 3.090602
H  -1.25282 2.646266 2.53833
H  -3.188564 1.760315 -1.927196
H  -3.593013 1.91431 2.355549
H  -1.893479 -4.590108 0.309854
H  -1.197288 -6.089922 -0.297517
H  -0.631077 -4.962649 -2.468534
H  -1.396347 -3.472586 -1.894276
H  -2.356827 -4.929246 -2.121334
elementType: Cl F O N C H
totalener: -2074.25597227 hartree
nucrepener: 3356.43886420 hartree
electener: -5430.69483648 hartree
oneelecener: -9527.04415005 hartree
twoeener: 4096.34931357 hartree
cpcmener: -0.04338433 hartree
kineticenergy: 2067.53776777 hartree
xcener: -165.655725219572 hartree
chargesum: -0.0000000
charge: -0.054882 -0.178852 -0.182161 -0.182391 -0.258675 -0.296525 -0.285398 -0.427687 -0.472289 -0.397016 -0.395692 0.576438 0.038498 0.162613 0.210116 -0.014915 -0.123334 -0.188853 0.437889 0.212199 -0.074780 -0.037981 -0.278419 0.041538 -0.150935 0.414110 -0.125732 -0.161149 0.564532 0.037907 -0.254048 0.117212 0.150458 0.154828 0.161225 0.107698 0.104634 0.108430 0.159085 0.138545 0.156059 0.096445 0.113273 0.090242 0.089036 0.098705
qa: -0.0549 -0.1789 -0.1822 -0.1824 -0.2587 -0.2965 -0.2854 -0.4277 -0.4723 -0.3970 -0.3957 0.5764 0.0385 0.1626 0.2101 -0.0149 -0.1233 -0.1889 0.4379 0.2122 -0.0748 -0.0380 -0.2784 0.0415 -0.1509 0.4141 -0.1257 -0.1611 0.5645 0.0379 -0.2540 0.1172 0.1505 0.1548 0.1612 0.1077 0.1046 0.1084 0.1591 0.1385 0.1561 0.0964 0.1133 0.0902 0.0890 0.0987
va: 1.2609 1.1267 1.1159 1.1133 2.1585 2.1323 2.1650 2.0691 2.0106 1.8492 1.8688 4.0843 3.8585 3.8310 3.8090 3.8810 3.9323 4.0447 4.2138 3.7962 4.0408 3.6969 3.9585 3.9803 3.9824 4.0671 4.0392 4.0225 4.4113 3.8434 3.9173 1.0210 1.0121 1.0053 1.0127 1.0047 1.0109 1.0038 0.9990 1.0242 1.0051 1.0082 0.9966 1.0046 1.0147 1.0063
dispcorr: -0.023973613 hartree
energy: -2074.279945885237
dipole: 16.97245 -18.36065 -1.38821 -32.49883 32.64248 0.14366 8.43685 -6.60569 1.83115
magnitude: 2.30236 au
magnitude: 5.85214 debye
