program: Gaussian 09
title: 000056702
version: EM64L-G09RevD.01
frameworkgroup: C1[X(C10H22N4O2)]
method: RPBEPBE
basis: SDD
operation: Freq
keyword: #p
keyword: freq=noraman
keyword: PBEPBE/SDD
title: #p freq=noraman PBEPBE/SDD
converged: YES YES NO NO
title: Mulliken charges:
elementType: O O N N N N C C C C C C C C C C H H H H H H H H H H H H H H H H H H H H H H
charge: -0.250521 -0.250520 -0.274577 -0.274577 -0.370724 -0.370726 -0.016804 -0.016803 -0.386893 -0.386894 -0.677949 -0.677949 -0.698548 -0.698547 0.144146 0.144147 0.182314 0.182314 0.222675 0.198117 0.198117 0.222675 0.224990 0.231994 0.204273 0.204273 0.231994 0.224990 0.284700 0.284699 0.214522 0.204179 0.228288 0.214521 0.204179 0.228288 0.335817 0.335817
chargesum: 0.00000
title: Mulliken charges with hydrogens summed into heavy atoms:
elementType: O O N N N N C C C C C C C C C C
charge: -0.250521 -0.250520 0.010123 0.010122 -0.034906 -0.034909 0.165510 0.165511 0.033899 0.033898 -0.016691 -0.016691 -0.051559 -0.051558 0.144146 0.144147
polarizability: 2.07836150e+02 3.89261728e-04 1.19327561e+02 8.39344103e+00 6.41272718e-04 1.26584886e+02
1716.lowfreq: -6.7685 -3.7336 0.0005 0.0006 0.0007 10.2463 18.8690 23.9812 25.1377
frequency: 18.7496 23.9593 24.2630 32.3578 56.1352 67.2025 86.1415 88.7959 91.2628 162.1673 175.0198 199.2721 201.8498 208.2069 217.9924 229.1302 235.9167 285.6364 296.7686 334.1142 335.0607 388.4697 394.3575 457.7561 460.8246 464.8102 466.9449 493.2498 525.6621 610.1749 657.7332 729.5791 734.4079 758.1240 765.2179 777.3930 807.4028 825.5800 832.0998 908.0668 911.7813 922.9548 964.4296 964.8859 1005.2894 1013.5796 1038.7767 1041.9544 1050.9473 1097.8201 1113.1976 1154.6307 1162.5196 1166.3616 1168.8039 1176.4511 1216.7181 1224.5904 1265.0636 1265.4309 1294.6427 1294.8668 1338.6900 1338.7649 1347.8463 1348.2326 1385.1510 1385.5534 1393.6396 1393.7049 1432.4466 1438.1203 1454.7551 1454.7879 1465.4556 1465.4924 1477.6237 1477.7315 1480.5682 1480.8309 1488.9998 1490.4262 1512.8734 1522.1135 1643.0887 1651.4585 2843.7716 2843.7833 2973.3892 2973.4172 2987.0148 2987.0759 2992.8733 2992.9400 3040.6487 3040.6493 3069.1187 3069.1865 3075.6845 3075.7066 3084.7837 3084.9888 3093.9743 3094.0702 3353.9806 3354.1760 3430.0454 3430.0798
redmass: 2.7567 4.0673 3.6567 4.9131 4.2479 5.2401 2.4390 3.4364 1.6752 2.4575 2.3977 2.4579 1.2058 1.2800 1.3721 1.4369 2.5983 3.0877 3.9415 4.6555 2.9734 2.5591 2.5195 2.7406 3.6562 2.3170 1.9443 8.5380 3.2696 2.1834 2.4734 1.1395 1.0984 1.8072 1.2899 3.3191 3.7604 1.8540 2.1235 2.4714 2.2680 5.0852 1.1972 1.2013 1.5969 1.3827 3.1271 3.2021 3.3726 2.1535 2.0146 2.9664 2.2972 2.1684 2.1072 3.2662 2.1285 2.3008 1.2456 1.2535 1.2308 1.2292 1.3836 1.3878 1.4848 1.4786 1.2110 1.2108 1.2180 1.2169 1.2495 1.1946 1.0694 1.0695 1.0595 1.0604 1.0610 1.0613 1.0548 1.0551 1.0795 1.0750 1.7339 1.6160 7.2750 9.5401 1.0815 1.0816 1.0366 1.0365 1.0372 1.0374 1.0587 1.0585 1.1002 1.1002 1.1007 1.1007 1.0990 1.0990 1.0992 1.0991 1.1004 1.1004 1.0763 1.0754 1.0751 1.0750
irintensity: 0.0984 1.6547 0.5054 1.0122 0.2174 1.6216 2.4469 2.7603 0.4380 0.1890 21.9081 0.8152 0.8320 1.1570 0.4652 12.8435 1.3839 1.7582 0.2522 12.7618 1.0707 7.0417 10.7133 10.5019 12.0896 10.0968 33.8798 10.1352 1.8713 87.3105 16.0454 29.9627 189.7735 21.4812 7.1804 8.9197 20.2733 1.2185 19.1867 2.0544 8.4926 0.9822 19.0777 1.4279 9.8656 1.7441 14.9011 0.9881 42.8876 0.2429 27.0961 0.1252 26.0743 2.1565 0.0750 12.6815 0.0030 14.7009 1.6829 0.0157 1.9717 0.0081 7.4909 8.4369 14.8356 15.0589 2.0576 23.8850 12.9281 27.0600 43.6670 0.5429 1.0656 4.9039 31.1894 0.6202 5.9496 3.0988 4.8180 21.5176 50.8788 5.9520 0.0338 248.1104 428.4209 2.2868 153.9923 12.8608 13.1405 47.7695 3.1585 19.6814 22.2915 47.5067 0.7700 0.7026 100.6975 31.8131 86.7749 0.0543 86.8562 11.8099 5.4695 58.6425 44.4969 0.2267 1.4313 0.0108
temp: 298.150 k
press: 1.00000 atm
elementType: 8 8 7 7 7 7 6 6 6 6 6 6 6 6 6 6 1 1 1 1 1 1 1 1 1 1 1 1 1 1 1 1 1 1 1 1 1 1
symmnumber: 1
zpe: 853555.1 jmol-1
zpe.correction: 0.325102 hartree
zpe.thermalcorrener: 0.345278 hartree
zpe.thermalcorrenthalpy: 0.346222 hartree
zpe.thermalcorrgfe: 0.273202 hartree
zpe.sumelectzpe: -762.371384 hartree
zpe.sumelectthermal: -762.351208 hartree
zpe.sumelectthermalent: -762.350264 hartree
zpe.sumelectthermalfe: -762.423284 hartree
dipole: 0.0000 0.0198 0.0000
dipole: 0.0198
quadrupole: -66.6657 -94.9453 -110.5802
quadrupole: 0.0003 10.3867 -0.0005
quadrupole: 24.0647 -4.2149 -19.8498 0.0003 10.3867 -0.0005
hfenergy: -762.6964858 hartree
pointgroup: C01 [X(C10H22N4O2)]
dipole: 0.000011 -0.0078053 -0.0000009 debye
polarizability: 207.5977335|-0.0001914|119.3275614|-9.4744189|0.0002818|126.823302 unknown
InChI: InChI=1S/C10H22N4O2/c1-5-7(3)11-13-9(15)10(16)14-12-8(4)6-2/h7-8,11-14H,5-6H2,1-4H3
charge 0 multiplicity 1
38 atoms
O  0.544006 0.197141 1.721526
O  -0.543964 0.197201 -1.72147
N  3.068417 0.127333 0.238638
N  -3.068378 0.127376 -0.238585
N  1.768739 0.208621 -0.310945
N  -1.768699 0.208627 0.311001
C  3.908831 -0.956578 -0.346024
C  -3.908793 -0.956572 0.346008
C  5.358202 -0.780046 0.167412
C  -5.358166 -0.7800 -0.167408
C  3.330721 -2.32982 0.04398
C  -3.330689 -2.329789 -0.044092
C  6.07231 0.498781 -0.328273
C  -6.072273 0.498789 0.32838
C  0.630382 0.201514 0.456996
C  -0.630341 0.201529 -0.45694
H  3.92735 -0.881348 -1.464841
H  -3.927305 -0.881418 1.464831
H  5.338655 -0.80249 1.274316
H  5.934574 -1.665692 -0.161713
H  -5.934537 -1.665671 0.161652
H  -5.338624 -0.802359 -1.274314
H  2.285008 -2.435439 -0.29487
H  3.347104 -2.447874 1.1417
H  3.922969 -3.141823 -0.415895
H  -3.922936 -3.141821 0.415733
H  -3.347084 -2.447769 -1.141821
H  -2.284974 -2.435434 0.294742
H  3.524451 1.050233 0.229971
H  -3.524412 1.050275 -0.229854
H  6.043967 0.569385 -1.432208
H  5.624534 1.423215 0.083538
H  7.133027 0.496433 -0.018996
H  -6.043928 0.569304 1.432321
H  -5.624496 1.423255 -0.083357
H  -7.13299 0.496466 0.019104
H  1.612857 0.208098 -1.333938
H  -1.612815 0.208067 1.333994
