program: Gaussian 09
title: 000056720
version: EM64L-G09RevD.01
frameworkgroup: C1[X(C15H16N2O)]
method: RPBEPBE
basis: SDD
operation: Freq
keyword: #p
keyword: freq=noraman
keyword: PBEPBE/SDD
title: #p freq=noraman PBEPBE/SDD
converged: YES YES NO NO
title: Mulliken charges:
elementType: O N N C C C C C C C C C C C C C C C H H H H H H H H H H H H H H H H
charge: -0.267070 -0.431982 -0.125703 -0.671450 0.410577 0.246728 0.221541 -0.386365 0.191320 -0.484131 -0.493535 0.149491 -0.391961 -0.407923 -0.394594 -0.265596 -0.234349 -0.532264 0.253038 0.240879 0.219218 0.223897 0.224967 0.226521 0.304981 0.236383 0.278644 0.240106 0.272708 0.228580 0.228139 0.244805 0.223443 0.220958
chargesum: 0.00000
title: Mulliken charges with hydrogens summed into heavy atoms:
elementType: O N N C C C C C C C C C C C C C C C
charge: -0.267070 -0.127001 -0.125703 -0.177532 0.410577 0.246728 0.221541 0.056750 0.191320 -0.032643 -0.257152 0.149491 -0.113318 -0.167816 -0.121886 -0.037016 -0.006210 0.156941
polarizability: 2.21648829e+02 -1.61698047e+01 2.02075181e+02 1.90018079e+01 7.78654022e+00 1.15218630e+02
1716.lowfreq: -13.5320 -4.5415 -0.0007 -0.0005 -0.0001 6.9167 30.3496 37.7383 45.1782
frequency: 30.2652 37.4801 45.1251 89.2516 123.1402 134.4994 143.9351 191.7955 197.9450 206.4916 244.3243 265.1200 324.0804 356.7217 366.1363 424.9088 441.0418 462.5385 470.9550 492.6146 508.8530 583.5461 592.8794 602.0112 644.6852 695.2770 711.5829 717.9587 746.3334 786.2716 788.2904 807.2583 822.5059 829.3707 892.4642 896.7298 900.2137 928.9027 943.0975 951.0011 978.9109 982.8039 1001.2750 1022.1129 1039.1187 1049.9291 1072.7473 1079.3692 1113.7927 1144.7086 1155.2151 1164.4116 1176.2679 1182.1294 1183.0100 1210.1559 1237.5183 1241.9119 1252.5232 1275.3552 1279.2467 1295.4671 1311.9620 1375.0917 1387.9782 1424.0961 1433.4867 1437.9111 1441.1836 1459.6332 1466.6268 1467.3610 1468.7632 1476.3143 1502.7627 1520.8371 1586.4558 1592.6014 1603.2140 1629.5385 2961.7842 2964.9299 2996.8483 2999.1756 3036.4479 3050.1115 3062.4639 3064.4322 3120.4196 3126.4872 3127.3870 3142.3028 3157.4009 3164.8912 3174.7859 3572.8508
redmass: 4.2555 3.7763 4.4263 3.3580 3.1702 2.5796 3.7010 3.6209 4.1180 4.4953 1.2032 3.9805 2.9560 2.8787 4.6897 3.2266 1.2095 4.8149 3.4359 5.5375 4.1925 4.6042 3.6953 4.1762 3.3485 5.5031 3.5444 3.8121 3.9178 1.4891 4.4051 3.2379 1.5269 1.4259 2.2038 2.6076 2.3421 1.6116 4.0762 3.4816 1.3795 3.2271 1.3203 3.7554 2.9476 2.7921 3.7737 1.6901 1.2611 1.4873 1.5068 1.1558 1.1769 1.2330 1.4897 1.1164 2.0887 1.8567 1.4863 1.5554 1.5982 1.4804 1.6349 4.0577 1.9998 7.0736 1.4774 2.1194 1.9174 2.1165 1.1475 1.0498 1.1185 1.1063 1.1407 3.9240 6.3254 7.0101 6.4542 6.6585 1.0328 1.0642 1.0659 1.0627 1.0963 1.1039 1.1044 1.0980 1.0896 1.0995 1.0858 1.0905 1.0971 1.0930 1.0971 1.0791
irintensity: 1.0210 5.0409 0.0554 6.8698 0.6628 1.9811 2.6822 3.6190 8.8907 2.9170 0.8003 4.3507 4.7792 5.8558 5.3001 8.4741 131.6142 5.2004 0.2944 7.1101 2.6704 3.3479 4.6608 7.9012 0.8687 10.7076 3.5409 1.7798 0.8560 97.4477 8.2245 0.7343 36.8358 2.1162 1.4475 1.7272 10.9302 3.7050 13.0736 8.8735 5.4439 6.6228 0.1229 17.8616 9.8169 5.0424 98.7980 2.1208 0.1118 3.3646 8.1223 3.6058 5.2004 12.8953 12.3821 1.4140 148.3616 6.9283 4.3815 64.4081 6.2658 0.2971 4.2546 0.4513 64.2364 5.6698 13.8652 82.5110 21.2196 60.9927 6.0323 13.9405 2.0270 14.6453 12.6071 20.6817 95.7630 50.4139 39.9452 3.2307 75.4982 62.9780 64.2781 19.8965 46.0470 46.1203 47.1088 4.0176 23.9025 15.0705 7.7304 8.4381 17.9406 17.5897 15.5639 16.3840
temp: 298.150 k
press: 1.00000 atm
elementType: 8 7 7 6 6 6 6 6 6 6 6 6 6 6 6 6 6 6 1 1 1 1 1 1 1 1 1 1 1 1 1 1 1 1
symmnumber: 1
zpe: 728789.7 jmol-1
zpe.correction: 0.277581 hartree
zpe.thermalcorrener: 0.293351 hartree
zpe.thermalcorrenthalpy: 0.294295 hartree
zpe.thermalcorrgfe: 0.233347 hartree
zpe.sumelectzpe: -764.617150 hartree
zpe.sumelectthermal: -764.601381 hartree
zpe.sumelectthermalent: -764.600437 hartree
zpe.sumelectthermalfe: -764.661385 hartree
dipole: 2.4187 -2.6515 2.4834
dipole: 4.3644
quadrupole: -98.6999 -94.4758 -107.0668
quadrupole: -5.4148 -5.9392 0.9569
quadrupole: 1.3809 5.6050 -6.9859 -5.4148 -5.9392 0.9569
hfenergy: -764.8947318 hartree
pointgroup: C01 [X(C15H16N2O1)]
dipole: 0.6548398 -1.3235681 0.8761832 debye
polarizability: 211.0032751|-22.2457874|206.7817936|25.3995766|13.4900251|121.1575724 unknown
InChI: InChI=1S/C15H16N2O/c1-18-14-7-6-11(10-15-16-8-9-17-15)12-4-2-3-5-13(12)14/h2-7,16H,8-10H2,1H3
charge 0 multiplicity 1
34 atoms
O  3.52014 -1.239675 0.838053
N  -2.953011 -0.803694 0.632252
N  -3.651737 0.959495 -0.678826
C  -1.69987 -0.367002 -1.520277
C  -0.327192 -0.593612 -0.893895
C  -2.788859 -0.026253 -0.52097
C  0.413283 0.496686 -0.293768
C  -3.983823 -0.178787 1.49521
C  1.716569 0.247202 0.286655
C  -4.579001 0.897406 0.508254
C  0.242866 -1.869944 -0.897247
C  2.252145 -1.094545 0.255063
C  -0.097682 1.838473 -0.256485
C  1.52619 -2.137824 -0.328125
C  2.452995 1.324398 0.873699
C  0.64137 2.874996 0.321514
C  1.925423 2.618588 0.891746
C  4.12256 -2.573744 0.821464
H  -1.684297 0.452317 -2.259855
H  -2.001501 -1.283339 -2.06246
H  -3.529255 0.287026 2.393227
H  -4.740687 -0.912312 1.82493
H  -5.587027 0.606291 0.15708
H  -4.660157 1.89531 0.972853
H  -2.209332 -1.3998 0.995462
H  -0.305893 -2.698855 -1.361106
H  -1.08539 2.049432 -0.679313
H  1.922378 -3.156352 -0.365588
H  3.435547 1.110076 1.30276
H  0.233442 3.891834 0.336565
H  2.495876 3.438659 1.341655
H  5.096642 -2.456393 1.318394
H  4.27126 -2.932611 -0.215435
H  3.502026 -3.300945 1.380512
