program: Orca
programVersion: 5.0.2
elementType: Cl F F F O O O O O O O N C C C C C C C C C C C C C C C C C C C H H H H H H H H H H H H H H H
charge: 0
multiplicity: 1
keywords: wb97x-d3
keywords: def2-TZVPP
keywords: def2/J RIJCOSX
keywords: DEFGRID2
keywords: scfconv7
keywords: smallprint printgap noloewdin
keywords: NOSOSCF
formula: C19H15ClF3NO7
InChI: InChI=1/C19H15ClF3NO7/c1-3-29-17(25)10(2)30-18(26)13-9-12(5-6-15(13)24(27)28)31-16-7-4-11(8-14(16)20)19(21,22)23/h4-10H,3H2,1-2H3
46 atoms
Cl -0.57451 1.809266 2.377039
F  -5.924193 1.991679 -0.57989
F  -5.287251 -0.048776 -0.778834
F  -5.535364 0.814558 1.176139
O  2.3713 -2.026972 0.396799
O  0.182561 2.969963 -0.232722
O  -0.034482 -2.821522 -0.185176
O  2.27482 -1.788042 -1.828778
O  0.631384 -4.854217 -0.844103
O  4.908452 -1.067708 -0.523463
O  5.948619 0.733212 -0.046506
N  4.933894 0.119132 -0.273876
C  2.487989 0.140524 -0.45444
C  2.19973 -3.441041 0.272086
C  1.299891 2.208534 -0.238243
C  3.678567 0.828946 -0.252204
C  1.29005 0.834576 -0.447431
C  2.494604 2.893728 -0.041917
C  2.404536 -1.328978 -0.724885
C  -1.064648 2.40918 -0.202342
C  3.684011 2.202969 -0.048553
C  -3.679102 1.520616 -0.095144
C  2.32034 -4.03646 1.661136
C  -1.573322 1.881845 0.977706
C  -1.853747 2.458033 -1.338667
C  0.849165 -3.78286 -0.333008
C  -2.883904 1.43905 1.037381
C  -3.162796 2.016962 -1.28635
C  -5.105556 1.068355 -0.061273
C  -1.358513 -3.014328 -0.723879
C  -2.100437 -1.709786 -0.594011
H  2.974807 -3.854252 -0.377759
H  0.361725 0.299975 -0.61132
H  2.485858 3.963697 0.114631
H  4.609201 2.739764 0.101455
H  1.555031 -3.649996 2.333509
H  3.301705 -3.817667 2.079238
H  2.216581 -5.118366 1.604939
H  -1.445885 2.863712 -2.25468
H  -3.264513 1.044264 1.9690
H  -3.770306 2.073235 -2.179751
H  -1.855785 -3.809486 -0.16619
H  -1.285127 -3.321289 -1.768048
H  -1.631383 -0.919732 -1.181587
H  -2.167252 -1.384974 0.443932
H  -3.114856 -1.843711 -0.967227
elementType: Cl F O N C H
totalener: -2074.25672327 hartree
nucrepener: 3434.52377844 hartree
electener: -5508.78050171 hartree
oneelecener: -9680.92928257 hartree
twoeener: 4172.14878086 hartree
cpcmener: -0.04669715 hartree
kineticenergy: 2067.54687231 hartree
xcener: -165.658395220748 hartree
chargesum: 0.0000000
charge: -0.053994 -0.182243 -0.179063 -0.179257 -0.260366 -0.293926 -0.267619 -0.427633 -0.472853 -0.398109 -0.396863 0.580897 0.056332 0.142592 0.218651 -0.034806 -0.122180 -0.196356 0.438867 0.193827 -0.067333 -0.013238 -0.266385 0.084782 -0.142124 0.409136 -0.187796 -0.152146 0.566999 0.039459 -0.276671 0.116407 0.141206 0.153992 0.161620 0.108445 0.108042 0.104426 0.158054 0.134326 0.152317 0.109472 0.102040 0.089643 0.096230 0.103200
qa: -0.0540 -0.1822 -0.1791 -0.1793 -0.2604 -0.2939 -0.2676 -0.4276 -0.4729 -0.3981 -0.3969 0.5809 0.0563 0.1426 0.2187 -0.0348 -0.1222 -0.1964 0.4389 0.1938 -0.0673 -0.0132 -0.2664 0.0848 -0.1421 0.4091 -0.1878 -0.1521 0.5670 0.0395 -0.2767 0.1164 0.1412 0.1540 0.1616 0.1084 0.1080 0.1044 0.1581 0.1343 0.1523 0.1095 0.1020 0.0896 0.0962 0.1032
va: 1.2618 1.1181 1.1081 1.1256 2.1461 2.1360 2.1529 2.0742 2.0396 1.8470 1.8672 4.0868 3.8262 3.8400 3.7857 3.8998 3.9584 4.0435 4.2249 3.8092 4.0367 3.6039 3.9529 3.9243 3.9657 4.1072 4.0001 3.9993 4.3980 3.8797 3.9682 1.0215 1.0054 1.0067 1.0139 1.0045 1.0056 1.0115 0.9991 1.0278 1.0060 0.9951 0.9988 0.9977 0.9992 1.0136
dispcorr: -0.027809067 hartree
energy: -2074.284532337566
dipole: 15.82490 -17.89805 -2.07315 -19.30344 21.69074 2.38730 -3.64079 4.48829 0.84750
magnitude: 3.27344 au
magnitude: 8.32043 debye
