program: Orca
programVersion: 5.0.2
elementType: Cl F F F O O O O O O O N C C C C C C C C C C C C C C C C C C C H H H H H H H H H H H H H H H
charge: 0
multiplicity: 1
keywords: wb97x-d3
keywords: def2-TZVPP
keywords: def2/J RIJCOSX
keywords: DEFGRID2
keywords: scfconv7
keywords: smallprint printgap noloewdin
keywords: NOSOSCF
formula: C19H15ClF3NO7
InChI: InChI=1/C19H15ClF3NO7/c1-3-29-17(25)10(2)30-18(26)13-9-12(5-6-15(13)24(27)28)31-16-7-4-11(8-14(16)20)19(21,22)23/h4-10H,3H2,1-2H3
46 atoms
Cl -0.419495 3.004605 -2.189767
F  -5.719203 2.718403 -0.491664
F  -5.15499 0.818999 -1.31663
F  -5.584922 0.993431 0.784298
O  2.158582 -1.962585 0.897757
O  0.342652 3.107039 0.649861
O  0.15803 -4.756144 0.039278
O  2.049812 -1.750323 -1.331843
O  -0.394336 -2.608842 0.36133
O  4.756544 -1.191413 -0.224972
O  5.9178 0.59687 -0.311839
N  4.868818 0.014461 -0.182875
C  2.429474 0.171322 0.022362
C  1.85296 -3.352358 0.817537
C  1.402406 2.298107 0.429394
C  3.671714 0.793352 0.029677
C  1.28734 0.928634 0.221907
C  2.650255 2.914561 0.443546
C  2.226237 -1.289928 -0.238017
C  -0.930092 2.664687 0.432731
C  3.784058 2.161613 0.241281
C  -3.564765 1.934136 0.008259
C  2.063646 -3.940399 2.200539
C  -1.437265 2.60411 -0.861607
C  -1.736926 2.344347 1.508185
C  0.407018 -3.507102 0.372429
C  -2.753876 2.243625 -1.077322
C  -3.05875 1.983379 1.299309
C  -5.005813 1.609814 -0.248382
C  -1.180939 -5.115496 -0.353084
C  -2.099644 -5.28956 0.832658
H  2.515112 -3.844837 0.100055
H  0.320591 0.439524 0.220039
H  2.725985 3.98091 0.609387
H  4.750611 2.64445 0.249213
H  3.091698 -3.776911 2.522246
H  1.890634 -5.01488 2.180492
H  1.39132 -3.495522 2.934491
H  -1.332805 2.391504 2.510989
H  -3.133058 2.212661 -2.090368
H  -3.674757 1.744341 2.15486
H  -1.058744 -6.056852 -0.885746
H  -1.569228 -4.379568 -1.05882
H  -1.70008 -6.014456 1.542582
H  -3.059709 -5.667265 0.478592
H  -2.286789 -4.353171 1.356899
elementType: Cl F O N C H
totalener: -2074.26608376 hartree
nucrepener: 3332.86528477 hartree
electener: -5407.13136853 hartree
oneelecener: -9479.67458189 hartree
twoeener: 4072.54321337 hartree
cpcmener: -0.03637029 hartree
kineticenergy: 2067.54301132 hartree
xcener: -165.654269276318 hartree
chargesum: 0.0000000
charge: -0.052854 -0.179479 -0.180444 -0.178024 -0.256571 -0.292260 -0.285159 -0.402696 -0.445891 -0.385389 -0.384809 0.565162 0.036484 0.162928 0.191785 -0.017605 -0.106910 -0.181219 0.417086 0.194989 -0.080817 -0.030687 -0.279195 0.043126 -0.142354 0.398817 -0.146821 -0.137441 0.556151 0.037143 -0.253904 0.114872 0.147039 0.151747 0.159559 0.106596 0.102669 0.107110 0.156065 0.134148 0.154423 0.110915 0.094827 0.088440 0.097547 0.090899
qa: -0.0529 -0.1795 -0.1804 -0.1780 -0.2566 -0.2923 -0.2852 -0.4027 -0.4459 -0.3854 -0.3848 0.5652 0.0365 0.1629 0.1918 -0.0176 -0.1069 -0.1812 0.4171 0.1950 -0.0808 -0.0307 -0.2792 0.0431 -0.1424 0.3988 -0.1468 -0.1374 0.5562 0.0371 -0.2539 0.1149 0.1470 0.1517 0.1596 0.1066 0.1027 0.1071 0.1561 0.1341 0.1544 0.1109 0.0948 0.0884 0.0975 0.0909
va: 1.2623 1.1115 1.1211 1.1267 2.1537 2.1367 2.1589 2.1019 2.0436 1.8617 1.8823 4.1103 3.8553 3.8167 3.8212 3.8876 3.9156 4.0387 4.2531 3.8215 4.0482 3.6975 3.9582 3.9804 3.9893 4.1033 4.1029 3.9752 4.4189 3.8492 3.9172 1.0220 1.0137 1.0065 1.0145 1.0054 1.0130 1.0027 1.0003 1.0269 1.0056 0.9961 1.0081 1.0046 1.0068 1.0127
dispcorr: -0.023775637 hartree
energy: -2074.289859392984
dipole: 15.45102 -16.77790 -1.32688 -36.88100 36.77564 -0.10536 16.19033 -14.16155 2.02879
magnitude: 2.42645 au
magnitude: 6.16756 debye
