program: Orca
programVersion: 5.0.2
elementType: Cl F F F O O O O O O O N C C C C C C C C C C C C C C C C C C C H H H H H H H H H H H H H H H
charge: 0
multiplicity: 1
keywords: wb97x-d3
keywords: def2-TZVPP
keywords: def2/J RIJCOSX
keywords: DEFGRID2
keywords: scfconv7
keywords: smallprint printgap noloewdin
keywords: NOSOSCF
formula: C19H15ClF3NO7
InChI: InChI=1/C19H15ClF3NO7/c1-3-29-17(25)10(2)30-18(26)13-9-12(5-6-15(13)24(27)28)31-16-7-4-11(8-14(16)20)19(21,22)23/h4-10H,3H2,1-2H3
46 atoms
Cl -1.51678 1.817744 3.105744
F  -5.037447 0.632374 -1.807536
F  -5.736618 0.829842 0.216713
F  -5.641791 2.555248 -1.065025
O  2.944847 -2.321133 -0.14662
O  0.252561 2.542213 0.918701
O  0.919807 -3.593336 0.873221
O  1.322879 -1.959221 -1.646263
O  1.19974 -5.392558 -0.434768
O  4.452102 -0.940954 -2.022584
O  5.757722 0.340634 -0.916939
N  4.659637 -0.056245 -1.223061
C  2.306695 -0.114218 -0.515127
C  2.902997 -3.725269 -0.402878
C  1.302072 1.864133 0.394333
C  3.511877 0.575204 -0.609135
C  1.195815 0.538031 -0.013513
C  2.512054 2.538982 0.315703
C  2.141973 -1.556419 -0.865427
C  -1.007647 2.243016 0.498296
C  3.62167 1.889837 -0.187472
C  -3.603167 1.693332 -0.282865
C  4.020259 -4.363705 0.39905
C  -1.962587 1.903481 1.445574
C  -1.353749 2.312384 -0.843167
C  1.56459 -4.326107 -0.010447
C  -3.266254 1.635569 1.060035
C  -2.648668 2.036871 -1.234455
C  -5.006365 1.42448 -0.728683
C  -0.366493 -4.042925 1.339731
C  -1.471509 -3.675732 0.378427
H  3.056555 -3.91338 -1.468726
H  0.261049 -0.000067 0.084781
H  2.581169 3.570937 0.632652
H  4.555514 2.425877 -0.281573
H  3.87292 -4.238333 1.471657
H  4.978608 -3.925753 0.1218
H  4.065316 -5.429048 0.178577
H  -0.610028 2.587815 -1.580077
H  -3.99466 1.374275 1.815201
H  -2.90198 2.098098 -2.28451
H  -0.500076 -3.535672 2.293626
H  -0.340481 -5.116351 1.531184
H  -2.427179 -3.973288 0.812252
H  -1.371968 -4.182721 -0.580842
H  -1.508202 -2.600262 0.202626
elementType: Cl F O N C H
totalener: -2074.26483731 hartree
nucrepener: 3341.98053599 hartree
electener: -5416.24537331 hartree
oneelecener: -9496.32994342 hartree
twoeener: 4080.08457012 hartree
cpcmener: -0.03755224 hartree
kineticenergy: 2067.56809403 hartree
xcener: -165.656240611933 hartree
chargesum: -0.0000000
charge: -0.058933 -0.181566 -0.178507 -0.179820 -0.265675 -0.302945 -0.271879 -0.407024 -0.444833 -0.373045 -0.378409 0.546896 0.055332 0.143967 0.216588 -0.014940 -0.132215 -0.181667 0.418818 0.188501 -0.072226 -0.047193 -0.266572 0.003850 -0.120219 0.389858 -0.116472 -0.152575 0.559697 0.029664 -0.253894 0.112458 0.162951 0.155360 0.158589 0.107199 0.106033 0.104008 0.166604 0.132883 0.153657 0.110312 0.095999 0.102207 0.094187 0.084994
qa: -0.0589 -0.1816 -0.1785 -0.1798 -0.2657 -0.3029 -0.2719 -0.4070 -0.4448 -0.3730 -0.3784 0.5469 0.0553 0.1440 0.2166 -0.0149 -0.1322 -0.1817 0.4188 0.1885 -0.0722 -0.0472 -0.2666 0.0039 -0.1202 0.3899 -0.1165 -0.1526 0.5597 0.0297 -0.2539 0.1125 0.1630 0.1554 0.1586 0.1072 0.1060 0.1040 0.1666 0.1329 0.1537 0.1103 0.0960 0.1022 0.0942 0.0850
va: 1.2555 1.1183 1.1260 1.1125 2.1391 2.1225 2.1441 2.1040 2.0712 1.8730 1.8766 4.0853 3.7941 3.8242 3.8355 3.8457 3.9458 4.0401 4.2109 3.8566 4.0289 3.7013 3.9545 3.9792 3.9384 4.1615 4.0246 4.0260 4.4145 3.8386 3.9226 1.0235 0.9959 1.0027 1.0102 1.0046 1.0069 1.0120 0.9910 1.0272 1.0067 0.9965 1.0115 1.0080 1.0116 1.0034
dispcorr: -0.024574490 hartree
energy: -2074.289411804859
dipole: 25.94431 -26.34944 -0.40513 -27.90693 29.77130 1.86437 1.15110 0.35827 1.50937
magnitude: 2.43274 au
magnitude: 6.18353 debye
