program: Orca
programVersion: 5.0.2
elementType: Cl F F F O O O O O O O N C C C C C C C C C C C C C C C C C C C H H H H H H H H H H H H H H H
charge: 0
multiplicity: 1
keywords: wb97x-d3
keywords: def2-TZVPP
keywords: def2/J RIJCOSX
keywords: DEFGRID2
keywords: scfconv7
keywords: smallprint printgap noloewdin
keywords: NOSOSCF
formula: C19H15ClF3NO7
InChI: InChI=1/C19H15ClF3NO7/c1-3-29-17(25)10(2)30-18(26)13-9-12(5-6-15(13)24(27)28)31-16-7-4-11(8-14(16)20)19(21,22)23/h4-10H,3H2,1-2H3
46 atoms
Cl -1.188159 2.452384 2.906498
F  -5.554034 1.674786 -1.315161
F  -4.933297 -0.316552 -0.81592
F  -5.674134 0.991214 0.720977
O  2.622365 -2.21123 0.314544
O  0.322425 2.800207 0.452854
O  0.123396 -2.955876 0.412857
O  1.929861 -1.828657 -1.778418
O  0.520199 -4.824462 -0.764842
O  4.856042 -1.154793 -1.124581
O  6.000187 0.58279 -0.648531
N  4.952299 -0.006781 -0.74877
C  2.524457 0.010165 -0.402125
C  2.369478 -3.609565 0.148555
C  1.413508 2.060233 0.159482
C  3.734629 0.692376 -0.412619
C  1.359639 0.69706 -0.107567
C  2.629717 2.736757 0.15479
C  2.363333 -1.442012 -0.726778
C  -0.93091 2.311024 0.232068
C  3.789319 2.05077 -0.128017
C  -3.528911 1.440707 -0.148951
C  2.779833 -4.300313 1.433401
C  -1.771033 2.127411 1.320924
C  -1.389723 2.05288 -1.051071
C  0.899097 -3.8635 -0.146883
C  -3.075921 1.699028 1.134632
C  -2.686069 1.614386 -1.242051
C  -4.925365 0.950864 -0.382279
C  -1.297664 -3.008919 0.188833
C  -1.67569 -2.32844 -1.105022
H  2.954496 -3.997201 -0.688915
H  0.420413 0.158903 -0.082919
H  2.661473 3.797152 0.366389
H  4.729907 2.582208 -0.140902
H  2.210373 -3.935854 2.288416
H  3.841147 -4.143737 1.624373
H  2.613659 -5.372985 1.34136
H  -0.733979 2.203169 -1.899308
H  -3.714716 1.568563 1.997034
H  -3.029039 1.417733 -2.249436
H  -1.727622 -2.485386 1.041253
H  -1.646576 -4.041851 0.218492
H  -1.282606 -2.851768 -1.976499
H  -1.325294 -1.295412 -1.129818
H  -2.762623 -2.309003 -1.192093
elementType: Cl F O N C H
totalener: -2074.26460124 hartree
nucrepener: 3405.43140619 hartree
electener: -5479.69600743 hartree
oneelecener: -9622.71788525 hartree
twoeener: 4143.02187782 hartree
cpcmener: -0.03877435 hartree
kineticenergy: 2067.55226464 hartree
xcener: -165.656285905920 hartree
chargesum: -0.0000000
charge: -0.056014 -0.180226 -0.177460 -0.177618 -0.256371 -0.295735 -0.272925 -0.402697 -0.439742 -0.385117 -0.384331 0.566195 0.066363 0.146740 0.270749 -0.044483 -0.145926 -0.211528 0.415970 0.219606 -0.061764 -0.023306 -0.268835 0.016364 -0.133919 0.378805 -0.126401 -0.194022 0.561938 0.029932 -0.262940 0.112834 0.135713 0.152563 0.159646 0.105436 0.107010 0.104416 0.166262 0.134896 0.151797 0.109182 0.104062 0.106273 0.076458 0.102147
qa: -0.0560 -0.1802 -0.1775 -0.1776 -0.2564 -0.2957 -0.2729 -0.4027 -0.4397 -0.3851 -0.3843 0.5662 0.0664 0.1467 0.2707 -0.0445 -0.1459 -0.2115 0.4160 0.2196 -0.0618 -0.0233 -0.2688 0.0164 -0.1339 0.3788 -0.1264 -0.1940 0.5619 0.0299 -0.2629 0.1128 0.1357 0.1526 0.1596 0.1054 0.1070 0.1044 0.1663 0.1349 0.1518 0.1092 0.1041 0.1063 0.0765 0.1021
va: 1.2593 1.1195 1.1106 1.1275 2.1525 2.1452 2.1372 2.1030 2.0733 1.8623 1.8821 4.1070 3.8125 3.8217 3.8103 3.9158 3.9793 4.0473 4.2629 3.8076 4.0269 3.6511 3.9519 3.9866 3.9297 4.1631 4.0229 4.0065 4.4052 3.8180 3.9138 1.0228 1.0143 1.0061 1.0149 1.0070 1.0053 1.0097 0.9916 1.0262 1.0086 0.9997 1.0128 1.0129 1.0008 1.0154
dispcorr: -0.026816944 hartree
energy: -2074.291418184006
dipole: 19.49110 -20.76126 -1.27016 -22.76459 24.74236 1.97777 -3.14417 4.45457 1.31041
magnitude: 2.69110 au
magnitude: 6.84024 debye
