program: Orca
programVersion: 5.0.2
elementType: Cl F F F O O O O O O O N C C C C C C C C C C C C C C C C C C C H H H H H H H H H H H H H H H
charge: 0
multiplicity: 1
keywords: wb97x-d3
keywords: def2-TZVPP
keywords: def2/J RIJCOSX
keywords: DEFGRID2
keywords: scfconv7
keywords: smallprint printgap noloewdin
keywords: NOSOSCF
formula: C19H15ClF3NO7
InChI: InChI=1/C19H15ClF3NO7/c1-3-29-17(25)10(2)30-18(26)13-9-12(5-6-15(13)24(27)28)31-16-7-4-11(8-14(16)20)19(21,22)23/h4-10H,3H2,1-2H3
46 atoms
Cl -1.471274 3.08427 -2.647158
F  -5.473341 1.548275 1.785478
F  -5.888837 1.590393 -0.32313
F  -5.136895 -0.206199 0.592086
O  2.625855 -2.212832 -0.661598
O  0.267878 2.75014 -0.37369
O  0.153412 -3.151662 -0.674669
O  1.88974 -2.063869 1.447822
O  0.793727 -5.057984 0.321048
O  4.809978 -1.278311 0.97332
O  5.948024 0.495434 0.635272
N  4.902769 -0.105222 0.684144
C  2.482821 -0.084742 0.279826
C  2.453835 -3.637111 -0.669923
C  1.359024 1.998602 -0.107682
C  3.682668 0.608377 0.387784
C  1.317951 0.615121 0.019787
C  2.563468 2.685648 -0.001977
C  2.335536 -1.56506 0.450391
C  -0.991218 2.304853 -0.11705
C  3.726048 1.987963 0.23984
C  -3.624246 1.567861 0.336886
C  3.533982 -4.364158 0.101019
C  -1.9407 2.442794 -1.121342
C  -1.363836 1.796075 1.119096
C  1.041693 -4.029663 -0.252071
C  -3.259494 2.083352 -0.896646
C  -2.674576 1.420029 1.342268
C  -5.033163 1.130785 0.593048
C  -1.24005 -3.304256 -0.342584
C  -1.74219 -2.012247 0.253796
H  2.544326 -3.89484 -1.72898
H  0.388726 0.07113 -0.091516
H  2.58538 3.762261 -0.105563
H  4.658501 2.526356 0.330388
H  4.515544 -4.024057 -0.22614
H  3.477179 -5.429871 -0.114001
H  3.456706 -4.231476 1.178153
H  -0.633574 1.69891 1.912471
H  -3.98003 2.206242 -1.693622
H  -2.942518 1.02059 2.311543
H  -1.38237 -4.135239 0.346938
H  -1.762147 -3.542394 -1.270227
H  -1.242853 -1.789308 1.196884
H  -2.809993 -2.100031 0.455056
H  -1.604077 -1.171934 -0.426956
elementType: Cl F O N C H
totalener: -2074.26172751 hartree
nucrepener: 3388.71676867 hartree
electener: -5462.97849618 hartree
oneelecener: -9589.45132967 hartree
twoeener: 4126.47283349 hartree
cpcmener: -0.03813064 hartree
kineticenergy: 2067.54967150 hartree
xcener: -165.659063421962 hartree
chargesum: 0.0000000
charge: -0.057406 -0.180614 -0.178374 -0.177708 -0.259152 -0.296713 -0.273573 -0.405099 -0.437783 -0.378241 -0.382475 0.559926 0.052521 0.181293 0.282323 -0.033507 -0.166047 -0.207511 0.414794 0.257950 -0.065777 -0.051356 -0.293437 -0.015012 -0.177220 0.364331 -0.098310 -0.161667 0.560311 0.049158 -0.264307 0.121805 0.152339 0.153162 0.160395 0.102657 0.109374 0.108127 0.167053 0.133183 0.152276 0.095416 0.100587 0.092333 0.106013 0.083961
qa: -0.0574 -0.1806 -0.1784 -0.1777 -0.2592 -0.2967 -0.2736 -0.4051 -0.4378 -0.3782 -0.3825 0.5599 0.0525 0.1813 0.2823 -0.0335 -0.1660 -0.2075 0.4148 0.2579 -0.0658 -0.0514 -0.2934 -0.0150 -0.1772 0.3643 -0.0983 -0.1617 0.5603 0.0492 -0.2643 0.1218 0.1523 0.1532 0.1604 0.1027 0.1094 0.1081 0.1671 0.1332 0.1523 0.0954 0.1006 0.0923 0.1060 0.0840
va: 1.2581 1.1200 1.1261 1.1085 2.1523 2.1465 2.1517 2.0956 2.0801 1.8670 1.8836 4.1113 3.8078 3.8253 3.8074 3.8938 3.9836 4.0366 4.2748 3.7673 4.0233 3.6776 3.9431 3.9925 3.9439 4.2297 4.0039 3.9743 4.4093 3.8608 3.9214 0.9979 1.0034 1.0058 1.0149 1.0123 1.0117 1.0117 0.9903 1.0262 1.0079 1.0199 0.9945 1.0048 1.0136 0.9969
dispcorr: -0.027348564 hartree
energy: -2074.289076075850
dipole: 22.39427 -23.53311 -1.13885 -24.77947 26.70233 1.92285 3.56044 -4.61900 -1.05855
magnitude: 2.47283 au
magnitude: 6.28543 debye
