program: Orca
programVersion: 5.0.2
elementType: Cl F F F O O O O O O O N C C C C C C C C C C C C C C C C C C C H H H H H H H H H H H H H H H
charge: 0
multiplicity: 1
keywords: wb97x-d3
keywords: def2-TZVPP
keywords: def2/J RIJCOSX
keywords: DEFGRID2
keywords: scfconv7
keywords: smallprint printgap noloewdin
keywords: NOSOSCF
formula: C19H15ClF3NO7
InChI: InChI=1/C19H15ClF3NO7/c1-3-29-17(25)10(2)30-18(26)13-9-12(5-6-15(13)24(27)28)31-16-7-4-11(8-14(16)20)19(21,22)23/h4-10H,3H2,1-2H3
46 atoms
Cl -1.269639 3.733061 -2.074597
F  -5.514329 1.223593 -0.388589
F  -4.914043 0.02003 1.291113
F  -5.49876 2.065056 1.590086
O  2.131478 -2.109394 0.633974
O  0.457956 3.043723 0.151654
O  0.185598 -4.708496 -0.751364
O  2.256468 -1.796575 -1.580127
O  -0.399018 -2.635373 -0.148623
O  4.839126 -1.368072 -0.050679
O  6.017988 0.333293 0.468129
N  4.964261 -0.18832 0.196636
C  2.543336 0.055225 -0.115926
C  1.77864 -3.478533 0.4424
C  1.51847 2.206431 0.147665
C  3.776334 0.632678 0.163538
C  1.409379 0.848236 -0.128994
C  2.757363 2.78244 0.407436
C  2.336754 -1.38867 -0.454388
C  -0.80543 2.556749 0.301305
C  3.886481 1.994099 0.413904
C  -3.416569 1.684821 0.578222
C  1.765666 -4.136054 1.808933
C  -1.743136 2.841321 -0.682126
C  -1.17685 1.83837 1.427856
C  0.398557 -3.536715 -0.193833
C  -3.053915 2.416021 -0.542573
C  -2.479619 1.398885 1.565333
C  -4.836341 1.24578 0.761737
C  -1.106093 -4.953209 -1.342813
C  -1.100689 -6.354792 -1.893669
H  2.510274 -3.971746 -0.202531
H  0.450661 0.398214 -0.35529
H  2.830826 3.842945 0.607893
H  4.84612 2.443906 0.62371
H  2.751667 -4.067339 2.267456
H  1.518035 -5.191995 1.711174
H  1.035912 -3.670688 2.471764
H  -0.447772 1.624889 2.199271
H  -3.76932 2.653964 -1.317894
H  -2.750722 0.838937 2.450478
H  -1.28488 -4.221064 -2.132666
H  -1.881315 -4.831648 -0.583645
H  -0.931185 -7.095693 -1.111892
H  -0.343535 -6.482757 -2.667776
H  -2.072392 -6.56191 -2.342486
elementType: Cl F O N C H
totalener: -2074.26702974 hartree
nucrepener: 3307.21083558 hartree
electener: -5381.47786532 hartree
oneelecener: -9428.01570184 hartree
twoeener: 4046.53783651 hartree
cpcmener: -0.03682754 hartree
kineticenergy: 2067.55295050 hartree
xcener: -165.655112414724 hartree
chargesum: -0.0000000
charge: -0.057441 -0.178935 -0.180371 -0.179661 -0.254377 -0.297393 -0.276443 -0.404022 -0.447285 -0.385679 -0.385079 0.566132 0.042347 0.164159 0.253274 -0.026895 -0.138973 -0.199266 0.422923 0.212304 -0.073259 -0.043939 -0.275513 0.000829 -0.145819 0.391284 -0.118076 -0.143761 0.556199 0.039280 -0.248299 0.114476 0.147770 0.153903 0.160967 0.106603 0.102457 0.106837 0.167067 0.132190 0.152597 0.101038 0.099015 0.088459 0.089511 0.088867
qa: -0.0574 -0.1789 -0.1804 -0.1797 -0.2544 -0.2974 -0.2764 -0.4040 -0.4473 -0.3857 -0.3851 0.5661 0.0423 0.1642 0.2533 -0.0269 -0.1390 -0.1993 0.4229 0.2123 -0.0733 -0.0439 -0.2755 0.0008 -0.1458 0.3913 -0.1181 -0.1438 0.5562 0.0393 -0.2483 0.1145 0.1478 0.1539 0.1610 0.1066 0.1025 0.1068 0.1671 0.1322 0.1526 0.1010 0.0990 0.0885 0.0895 0.0889
va: 1.2575 1.1251 1.1208 1.1107 2.1550 2.1367 2.1655 2.1025 2.0494 1.8612 1.8823 4.1145 3.8349 3.8298 3.8122 3.9073 3.9520 4.0416 4.2523 3.8292 4.0342 3.7040 3.9578 3.9917 3.9652 4.1008 4.0388 4.0112 4.4165 3.8395 3.9746 1.0229 1.0100 1.0047 1.0148 1.0051 1.0115 1.0046 0.9904 1.0276 1.0067 0.9950 0.9958 1.0029 1.0030 1.0068
dispcorr: -0.023087237 hartree
energy: -2074.290116978753
dipole: 18.99081 -20.01944 -1.02863 -40.25462 39.99296 -0.26166 2.19800 -0.87985 1.31815
magnitude: 1.69235 au
magnitude: 4.30162 debye
