program: Orca
programVersion: 5.0.2
elementType: Cl F F F O O O O O O O N C C C C C C C C C C C C C C C C C C C H H H H H H H H H H H H H H H
charge: 0
multiplicity: 1
keywords: wb97x-d3
keywords: def2-TZVPP
keywords: def2/J RIJCOSX
keywords: DEFGRID2
keywords: scfconv7
keywords: smallprint printgap noloewdin
keywords: NOSOSCF
formula: C19H15ClF3NO7
InChI: InChI=1/C19H15ClF3NO7/c1-3-29-17(25)10(2)30-18(26)13-9-12(5-6-15(13)24(27)28)31-16-7-4-11(8-14(16)20)19(21,22)23/h4-10H,3H2,1-2H3
46 atoms
Cl -0.964441 3.163814 2.724411
F  -5.229151 0.441278 0.551694
F  -5.687928 2.528999 0.344476
F  -5.352268 1.324845 -1.405704
O  2.143635 -2.064928 0.588666
O  0.482242 2.98884 0.224301
O  0.050578 -4.721028 -0.449611
O  2.253664 -1.935835 -1.645736
O  -0.403324 -2.553209 -0.137727
O  4.892568 -1.328664 -0.483782
O  6.001982 0.435547 -0.948684
N  4.980005 -0.131456 -0.647162
C  2.552853 0.029257 -0.342533
C  1.742678 -3.432185 0.522132
C  1.530499 2.172139 -0.014833
C  3.786256 0.658048 -0.457403
C  1.419682 0.789546 -0.109726
C  2.768252 2.796445 -0.136459
C  2.337435 -1.436907 -0.557356
C  -0.803857 2.557434 0.10655
C  3.896469 2.038162 -0.354092
C  -3.47862 1.877944 -0.086009
C  1.753744 -3.974206 1.938873
C  -1.624929 2.633545 1.226098
C  -1.319304 2.123054 -1.10252
C  0.342398 -3.496165 -0.069754
C  -2.964269 2.306511 1.131681
C  -2.656837 1.776967 -1.199132
C  -4.936679 1.540303 -0.156466
C  -1.268091 -4.971789 -0.977335
C  -1.344842 -6.430416 -1.346293
H  2.436366 -4.001577 -0.10184
H  0.461809 0.294745 -0.009735
H  2.842094 3.872434 -0.051542
H  4.857546 2.525727 -0.433663
H  2.753729 -3.892337 2.363733
H  1.479879 -5.027887 1.936719
H  1.054725 -3.437097 2.580088
H  -0.680067 2.06682 -1.974613
H  -3.591286 2.386084 2.010561
H  -3.039865 1.444092 -2.153466
H  -1.434001 -4.336826 -1.84942
H  -2.014301 -4.716695 -0.22242
H  -0.610879 -6.692972 -2.108592
H  -2.334639 -6.640758 -1.751797
H  -1.195901 -7.075575 -0.480113
elementType: Cl F O N C H
totalener: -2074.26687810 hartree
nucrepener: 3301.82249795 hartree
electener: -5376.08937605 hartree
oneelecener: -9417.25416866 hartree
twoeener: 4041.16479261 hartree
cpcmener: -0.03624150 hartree
kineticenergy: 2067.54616539 hartree
xcener: -165.653686535023 hartree
chargesum: -0.0000000
charge: -0.057425 -0.180490 -0.181790 -0.177938 -0.256547 -0.295181 -0.278101 -0.402128 -0.443682 -0.383326 -0.384073 0.560888 0.038897 0.171176 0.278583 -0.024819 -0.151757 -0.215367 0.410603 0.225860 -0.063362 -0.050246 -0.275674 0.000705 -0.156991 0.391406 -0.142357 -0.121614 0.562746 0.039159 -0.247863 0.113573 0.149718 0.151847 0.159578 0.106123 0.102443 0.106930 0.166422 0.132073 0.155287 0.100215 0.099687 0.089320 0.089085 0.088407
qa: -0.0574 -0.1805 -0.1818 -0.1779 -0.2565 -0.2952 -0.2781 -0.4021 -0.4437 -0.3833 -0.3841 0.5609 0.0389 0.1712 0.2786 -0.0248 -0.1518 -0.2154 0.4106 0.2259 -0.0634 -0.0502 -0.2757 0.0007 -0.1570 0.3914 -0.1424 -0.1216 0.5627 0.0392 -0.2479 0.1136 0.1497 0.1518 0.1596 0.1061 0.1024 0.1069 0.1664 0.1321 0.1553 0.1002 0.0997 0.0893 0.0891 0.0884
va: 1.2572 1.1147 1.1171 1.1273 2.1623 2.1401 2.1673 2.1004 2.0469 1.8653 1.8817 4.1035 3.8564 3.8210 3.8206 3.8823 3.9669 4.0500 4.2565 3.8100 4.0259 3.7098 3.9593 3.9869 3.9803 4.0926 4.0886 3.9538 4.4171 3.8399 3.9743 1.0222 1.0163 1.0064 1.0133 1.0052 1.0121 1.0037 0.9921 1.0277 1.0047 0.9954 0.9954 1.0031 1.0067 1.0029
dispcorr: -0.022988050 hartree
energy: -2074.289866147342
dipole: 17.65708 -18.88987 -1.23279 -39.67612 39.52060 -0.15552 -5.47060 5.93384 0.46324
magnitude: 1.32610 au
magnitude: 3.37069 debye
