program: Orca
programVersion: 5.0.2
elementType: Cl F F F O O O O O O O N C C C C C C C C C C C C C C C C C C C H H H H H H H H H H H H H H H
charge: 0
multiplicity: 1
keywords: wb97x-d3
keywords: def2-TZVPP
keywords: def2/J RIJCOSX
keywords: DEFGRID2
keywords: scfconv7
keywords: smallprint printgap noloewdin
keywords: NOSOSCF
formula: C19H15ClF3NO7
InChI: InChI=1/C19H15ClF3NO7/c1-3-29-17(25)10(2)30-18(26)13-9-12(5-6-15(13)24(27)28)31-16-7-4-11(8-14(16)20)19(21,22)23/h4-10H,3H2,1-2H3
46 atoms
Cl -1.245333 3.81038 -2.03318
F  -5.604156 1.496599 -0.397376
F  -4.957455 -0.068409 0.933168
F  -5.440691 1.873663 1.714423
O  2.175537 -2.122602 0.598402
O  0.463708 2.983743 0.149827
O  0.035226 -4.679478 -0.591422
O  2.411811 -1.814634 -1.609902
O  -0.322441 -2.496166 -0.268735
O  4.923411 -1.349736 0.004822
O  6.082311 0.394442 0.415116
N  5.032756 -0.157541 0.192043
C  2.609562 0.038951 -0.130846
C  1.774514 -3.476399 0.405138
C  1.538237 2.165604 0.146629
C  3.828887 0.639621 0.156422
C  1.45898 0.808491 -0.142165
C  2.763989 2.764435 0.41925
C  2.431553 -1.405606 -0.482531
C  -0.80035 2.493308 0.271264
C  3.909653 2.000524 0.421206
C  -3.433783 1.669413 0.510193
C  1.78846 -4.15062 1.76402
C  -1.734359 2.851311 -0.691676
C  -1.184742 1.714114 1.353542
C  0.377819 -3.473278 -0.196561
C  -3.055794 2.451893 -0.569465
C  -2.497002 1.297767 1.469929
C  -4.859889 1.243319 0.682622
C  -1.285587 -4.866161 -1.1390
C  -1.446725 -6.328799 -1.458766
H  2.465293 -3.988884 -0.270064
H  0.511085 0.342291 -0.379778
H  2.814696 3.823716 0.632607
H  4.858875 2.467809 0.640382
H  1.520418 -5.200904 1.663216
H  1.088818 -3.680356 2.455266
H  2.789224 -4.104402 2.192349
H  -0.459982 1.439592 2.109584
H  -3.766488 2.752663 -1.326797
H  -2.778161 0.690735 2.32058
H  -1.393261 -4.251961 -2.035478
H  -2.030675 -4.539695 -0.410486
H  -0.718009 -6.665232 -2.196692
H  -2.440855 -6.491836 -1.875502
H  -1.353881 -6.949723 -0.567236
elementType: Cl F O N C H
totalener: -2074.26667124 hartree
nucrepener: 3306.82678502 hartree
electener: -5381.09345627 hartree
oneelecener: -9427.21225167 hartree
twoeener: 4046.11879541 hartree
cpcmener: -0.03649507 hartree
kineticenergy: 2067.53919714 hartree
xcener: -165.653151924302 hartree
chargesum: 0.0000000
charge: -0.057644 -0.178855 -0.181276 -0.180913 -0.256276 -0.295798 -0.280103 -0.402596 -0.445684 -0.386291 -0.385394 0.566502 0.047537 0.169405 0.268327 -0.031749 -0.152123 -0.208838 0.417551 0.229478 -0.069164 -0.051371 -0.278012 -0.008070 -0.155854 0.400812 -0.108530 -0.148825 0.559749 0.039334 -0.247917 0.113263 0.151684 0.153454 0.160985 0.101933 0.106403 0.105906 0.167000 0.133235 0.152753 0.101534 0.097618 0.089259 0.089200 0.088361
qa: -0.0576 -0.1789 -0.1813 -0.1809 -0.2563 -0.2958 -0.2801 -0.4026 -0.4457 -0.3863 -0.3854 0.5665 0.0475 0.1694 0.2683 -0.0317 -0.1521 -0.2088 0.4176 0.2295 -0.0692 -0.0514 -0.2780 -0.0081 -0.1559 0.4008 -0.1085 -0.1488 0.5597 0.0393 -0.2479 0.1133 0.1517 0.1535 0.1610 0.1019 0.1064 0.1059 0.1670 0.1332 0.1528 0.1015 0.0976 0.0893 0.0892 0.0884
va: 1.2577 1.1258 1.1183 1.1122 2.1503 2.1397 2.1650 2.1028 2.0472 1.8612 1.8818 4.1137 3.8321 3.8212 3.8171 3.9107 3.9636 4.0453 4.2658 3.8105 4.0282 3.7111 3.9642 3.9967 3.9643 4.0899 4.0124 4.0213 4.4142 3.8405 3.9740 1.0225 1.0093 1.0051 1.0147 1.0130 1.0026 1.0052 0.9904 1.0269 1.0062 0.9951 0.9962 1.0032 1.0067 1.0031
dispcorr: -0.023111627 hartree
energy: -2074.289782868097
dipole: 17.75485 -19.01502 -1.26017 -40.47292 40.07742 -0.39551 3.63483 -2.20905 1.42578
magnitude: 1.94353 au
magnitude: 4.94005 debye
