program: Orca
programVersion: 5.0.2
elementType: Cl F F F O O O O O O O N C C C C C C C C C C C C C C C C C C C H H H H H H H H H H H H H H H
charge: 0
multiplicity: 1
keywords: wb97x-d3
keywords: def2-TZVPP
keywords: def2/J RIJCOSX
keywords: DEFGRID2
keywords: scfconv7
keywords: smallprint printgap noloewdin
keywords: NOSOSCF
formula: C19H15ClF3NO7
InChI: InChI=1/C19H15ClF3NO7/c1-3-29-17(25)10(2)30-18(26)13-9-12(5-6-15(13)24(27)28)31-16-7-4-11(8-14(16)20)19(21,22)23/h4-10H,3H2,1-2H3
46 atoms
Cl -1.192389 2.240274 2.850804
F  -4.879248 -0.443489 -0.63393
F  -5.704138 1.285772 0.343192
F  -5.298733 1.336225 -1.76659
O  2.410949 -2.176995 0.295305
O  0.377396 2.740477 0.457971
O  -0.049251 -2.569426 -0.275067
O  2.436574 -1.819388 -1.922325
O  0.036381 -4.795249 -0.038297
O  5.063148 -1.161604 -0.742228
O  6.062616 0.713415 -0.947861
N  5.077093 0.049803 -0.736622
C  2.646483 0.015619 -0.425084
C  2.06423 -3.55455 0.148508
C  1.487478 2.037822 0.140001
C  3.836069 0.732107 -0.452635
C  1.467492 0.672705 -0.118627
C  2.682209 2.749857 0.111937
C  2.523529 -1.432546 -0.790518
C  -0.861187 2.243785 0.180689
C  3.85718 2.094063 -0.182364
C  -3.445215 1.388435 -0.31976
C  2.520634 -4.276034 1.400261
C  -1.731702 2.000339 1.235392
C  -1.279166 2.039243 -1.124476
C  0.564989 -3.713287 -0.06471
C  -3.02855 1.580786 0.989469
C  -2.568819 1.607965 -1.375823
C  -4.834124 0.896911 -0.592558
C  -1.479342 -2.547934 -0.450187
C  -2.183948 -2.412849 0.877375
H  2.565925 -3.984563 -0.723944
H  0.540765 0.114969 -0.083152
H  2.687784 3.810447 0.324821
H  4.785168 2.647484 -0.19564
H  2.024284 -3.894875 2.292829
H  3.597308 -4.163709 1.522273
H  2.307618 -5.339454 1.314477
H  -0.600563 2.231636 -1.945733
H  -3.693609 1.406129 1.824692
H  -2.87708 1.459277 -2.40157
H  -1.806897 -3.434045 -0.994297
H  -1.66568 -1.679387 -1.080025
H  -2.015103 -3.27792 1.518863
H  -3.257391 -2.331697 0.706787
H  -1.861852 -1.516479 1.408947
elementType: Cl F O N C H
totalener: -2074.26332298 hartree
nucrepener: 3416.40950735 hartree
electener: -5490.67283033 hartree
oneelecener: -9644.30524518 hartree
twoeener: 4153.63241486 hartree
cpcmener: -0.03792285 hartree
kineticenergy: 2067.54385218 hartree
xcener: -165.654375822200 hartree
chargesum: 0.0000000
charge: -0.057368 -0.176043 -0.178620 -0.178953 -0.261172 -0.297457 -0.260598 -0.399718 -0.451738 -0.384017 -0.383876 0.563306 0.030206 0.163278 0.259194 -0.031823 -0.127947 -0.211647 0.419331 0.208146 -0.063566 -0.015512 -0.265226 0.025943 -0.125438 0.399949 -0.165681 -0.165460 0.559060 0.025715 -0.273333 0.105679 0.139413 0.152923 0.159481 0.105175 0.105168 0.097325 0.166456 0.131449 0.152635 0.111580 0.099866 0.105657 0.098205 0.090051
qa: -0.0574 -0.1760 -0.1786 -0.1790 -0.2612 -0.2975 -0.2606 -0.3997 -0.4517 -0.3840 -0.3839 0.5633 0.0302 0.1633 0.2592 -0.0318 -0.1279 -0.2116 0.4193 0.2081 -0.0636 -0.0155 -0.2652 0.0259 -0.1254 0.3999 -0.1657 -0.1655 0.5591 0.0257 -0.2733 0.1057 0.1394 0.1529 0.1595 0.1052 0.1052 0.0973 0.1665 0.1314 0.1526 0.1116 0.0999 0.1057 0.0982 0.0901
va: 1.2555 1.1065 1.1249 1.1238 2.1485 2.1397 2.1413 2.1053 2.0642 1.8643 1.8828 4.1031 3.8670 3.8115 3.8123 3.8864 3.9662 4.0470 4.2771 3.8333 4.0281 3.6268 3.9646 3.9482 3.9551 4.1448 4.0415 3.9742 4.4033 3.8044 3.9292 1.0208 1.0146 1.0057 1.0135 1.0023 1.0067 1.0182 0.9914 1.0293 1.0074 1.0140 1.0022 1.0129 1.0148 0.9965
dispcorr: -0.027062603 hartree
energy: -2074.290385582543
dipole: 16.91964 -18.45870 -1.53906 -21.64894 23.70588 2.05694 1.41876 -0.62373 0.79503
magnitude: 2.68920 au
magnitude: 6.83540 debye
