program: Orca
programVersion: 5.0.2
elementType: Cl F F F O O O O O O O N C C C C C C C C C C C C C C C C C C C H H H H H H H H H H H H H H H
charge: 0
multiplicity: 1
keywords: wb97x-d3
keywords: def2-TZVPP
keywords: def2/J RIJCOSX
keywords: DEFGRID2
keywords: scfconv7
keywords: smallprint printgap noloewdin
keywords: NOSOSCF
formula: C19H15ClF3NO7
InChI: InChI=1/C19H15ClF3NO7/c1-3-29-17(25)10(2)30-18(26)13-9-12(5-6-15(13)24(27)28)31-16-7-4-11(8-14(16)20)19(21,22)23/h4-10H,3H2,1-2H3
46 atoms
Cl -1.996586 0.871258 2.10204
F  -5.548084 4.653145 1.413094
F  -4.033541 5.959704 0.629618
F  -5.570274 5.197622 -0.66678
O  2.655607 -2.673935 0.440245
O  -1.426943 0.484646 -0.755758
O  2.782773 -5.985345 -0.806559
O  3.07283 -2.333947 -1.7368
O  1.106877 -4.496895 -0.77888
O  4.621635 -0.538947 0.06814
O  4.615713 1.585429 0.267598
N  4.057036 0.533399 0.07461
C  1.973718 -0.647167 -0.469312
C  3.166525 -4.002249 0.366911
C  -0.094688 0.566688 -0.542211
C  2.63115 0.539167 -0.152375
C  0.607499 -0.62918 -0.661644
C  0.565663 1.750601 -0.234012
C  2.664887 -1.960199 -0.672269
C  -2.221014 1.563532 -0.491739
C  1.932034 1.730152 -0.039385
C  -3.900941 3.69358 0.037162
C  3.231502 -4.535506 1.78593
C  -2.586927 1.853793 0.818113
C  -2.697079 2.337776 -1.533515
C  2.222592 -4.837875 -0.483571
C  -3.423441 2.9203 1.087102
C  -3.542438 3.403452 -1.272082
C  -4.768318 4.874618 0.349846
C  2.004887 -6.951701 -1.53918
C  1.094828 -7.745693 -0.632717
H  4.164915 -4.000422 -0.078876
H  0.075588 -1.541386 -0.904361
H  0.037265 2.690217 -0.14503
H  2.442919 2.650551 0.204623
H  2.244348 -4.565973 2.247875
H  3.882252 -3.9062 2.392345
H  3.645658 -5.54214 1.789911
H  -2.40898 2.100566 -2.549479
H  -3.694667 3.135061 2.111885
H  -3.907207 3.996655 -2.099426
H  2.746523 -7.598341 -2.004819
H  1.446764 -6.455024 -2.333936
H  0.313016 -7.130162 -0.188354
H  1.655203 -8.230278 0.167297
H  0.608043 -8.527306 -1.217421
elementType: Cl F O N C H
totalener: -2074.26614736 hartree
nucrepener: 3215.94198783 hartree
electener: -5290.20813519 hartree
oneelecener: -9245.42356815 hartree
twoeener: 3955.21543296 hartree
cpcmener: -0.03699717 hartree
kineticenergy: 2067.56003287 hartree
xcener: -165.657557708710 hartree
chargesum: 0.0000000
charge: -0.053018 -0.180235 -0.178643 -0.178215 -0.256229 -0.291903 -0.284635 -0.403520 -0.444310 -0.385242 -0.385163 0.565334 0.042909 0.160793 0.210421 -0.016445 -0.168946 -0.120550 0.419356 0.187703 -0.105317 -0.026621 -0.277817 0.042811 -0.136350 0.396406 -0.142174 -0.145843 0.556829 0.038524 -0.254735 0.115466 0.139435 0.155957 0.161477 0.106664 0.106587 0.102153 0.156542 0.132590 0.155359 0.111223 0.093579 0.091717 0.088553 0.097522
qa: -0.0530 -0.1802 -0.1786 -0.1782 -0.2562 -0.2919 -0.2846 -0.4035 -0.4443 -0.3852 -0.3852 0.5653 0.0429 0.1608 0.2104 -0.0164 -0.1689 -0.1206 0.4194 0.1877 -0.1053 -0.0266 -0.2778 0.0428 -0.1363 0.3964 -0.1422 -0.1458 0.5568 0.0385 -0.2547 0.1155 0.1394 0.1560 0.1615 0.1067 0.1066 0.1022 0.1565 0.1326 0.1554 0.1112 0.0936 0.0917 0.0886 0.0975
va: 1.2617 1.1219 1.1110 1.1254 2.1534 2.1349 2.1596 2.0998 2.0447 1.8617 1.8832 4.1145 3.8528 3.8184 3.8399 3.8977 4.0791 3.9145 4.2479 3.8199 4.0733 3.6902 3.9570 3.9841 3.9810 4.1089 4.0964 3.9888 4.4167 3.8472 3.9201 1.0215 1.0272 1.0005 1.0169 1.0033 1.0051 1.0129 0.9995 1.0281 1.0052 0.9959 1.0096 1.0111 1.0046 1.0071
dispcorr: -0.023280546 hartree
energy: -2074.289427902349
dipole: 29.93875 -31.41602 -1.47727 -56.27383 55.50020 -0.77363 -6.47914 6.56682 0.08769
magnitude: 1.66989 au
magnitude: 4.24452 debye
