program: Orca
programVersion: 5.0.2
elementType: Cl F F F O O O O O O O N C C C C C C C C C C C C C C C C C C C H H H H H H H H H H H H H H H
charge: 0
multiplicity: 1
keywords: wb97x-d3
keywords: def2-TZVPP
keywords: def2/J RIJCOSX
keywords: DEFGRID2
keywords: scfconv7
keywords: smallprint printgap noloewdin
keywords: NOSOSCF
formula: C19H15ClF3NO7
InChI: InChI=1/C19H15ClF3NO7/c1-3-29-17(25)10(2)30-18(26)13-9-12(5-6-15(13)24(27)28)31-16-7-4-11(8-14(16)20)19(21,22)23/h4-10H,3H2,1-2H3
46 atoms
Cl -1.998672 0.804317 2.117059
F  -6.183728 4.226792 0.648376
F  -4.635857 5.367572 1.609858
F  -5.044717 5.654845 -0.482514
O  2.634019 -2.644402 0.551522
O  -1.432644 0.518476 -0.754406
O  2.887554 -5.960992 -0.633981
O  2.974726 -2.431587 -1.653395
O  1.09939 -4.617013 -0.484066
O  4.615271 1.537146 0.316189
O  4.603921 -0.579696 0.049639
N  4.048046 0.496894 0.089161
C  1.948416 -0.658871 -0.441413
C  3.178819 -3.962018 0.538326
C  -0.099805 0.585697 -0.541732
C  2.623447 0.522462 -0.143962
C  0.583692 -0.622419 -0.640071
C  0.578167 1.765743 -0.259376
C  2.61261 -1.991435 -0.597007
C  -2.231223 1.582585 -0.450212
C  1.944249 1.727818 -0.061744
C  -3.964385 3.654738 0.143866
C  3.269459 -4.421631 1.98108
C  -2.607108 1.819288 0.868633
C  -2.715056 2.387433 -1.464937
C  2.256726 -4.865943 -0.264914
C  -3.475406 2.852752 1.169075
C  -3.588325 3.42184 -1.171675
C  -4.953238 4.730809 0.477244
C  2.1735 -6.949519 -1.401126
C  2.125775 -6.590138 -2.867679
H  4.174313 -3.952092 0.085819
H  0.037874 -1.530942 -0.864829
H  0.0634 2.715068 -0.1960
H  2.469514 2.646252 0.157781
H  3.706514 -5.417717 2.030102
H  2.287971 -4.450379 2.455301
H  3.913239 -3.748319 2.54672
H  -2.414893 2.195221 -2.48693
H  -3.762885 3.018425 2.199584
H  -3.961297 4.034016 -1.98138
H  1.173751 -7.094906 -0.989626
H  2.735454 -7.869074 -1.247079
H  1.54021 -5.690424 -3.054923
H  1.660241 -7.409185 -3.417574
H  3.12707 -6.444466 -3.273956
elementType: Cl F O N C H
totalener: -2074.26618822 hartree
nucrepener: 3218.77561482 hartree
electener: -5293.04180304 hartree
oneelecener: -9251.13895005 hartree
twoeener: 3958.09714701 hartree
cpcmener: -0.03702684 hartree
kineticenergy: 2067.53891879 hartree
xcener: -165.653111360474 hartree
chargesum: 0.0000000
charge: -0.052239 -0.179005 -0.180398 -0.178458 -0.253507 -0.291125 -0.281997 -0.407082 -0.445863 -0.384905 -0.385509 0.565458 0.042349 0.155773 0.196599 -0.017410 -0.163640 -0.110708 0.426433 0.189389 -0.103740 -0.029838 -0.278453 0.045148 -0.143929 0.395718 -0.148250 -0.137071 0.556452 0.036493 -0.253292 0.114540 0.138855 0.157134 0.161960 0.102801 0.106786 0.106351 0.156603 0.134098 0.155425 0.094029 0.110419 0.091083 0.096342 0.090183
qa: -0.0522 -0.1790 -0.1804 -0.1785 -0.2535 -0.2911 -0.2820 -0.4071 -0.4459 -0.3849 -0.3855 0.5655 0.0423 0.1558 0.1966 -0.0174 -0.1636 -0.1107 0.4264 0.1894 -0.1037 -0.0298 -0.2785 0.0451 -0.1439 0.3957 -0.1483 -0.1371 0.5565 0.0365 -0.2533 0.1145 0.1389 0.1571 0.1620 0.1028 0.1068 0.1064 0.1566 0.1341 0.1554 0.0940 0.1104 0.0911 0.0963 0.0902
va: 1.2627 1.1118 1.1214 1.1257 2.1540 2.1320 2.1608 2.0953 2.0468 1.8836 1.8610 4.1171 3.8606 3.8364 3.8437 3.9002 4.0737 3.9067 4.2304 3.8169 4.0689 3.6942 3.9580 3.9839 3.9861 4.1074 4.1030 3.9742 4.4176 3.8485 3.9198 1.0212 1.0249 0.9997 1.0169 1.0113 1.0041 1.0051 1.0001 1.0268 1.0054 1.0094 0.9962 1.0136 1.0069 1.0045
dispcorr: -0.023287277 hartree
energy: -2074.289475497634
dipole: 33.91260 -35.11185 -1.19924 -51.97785 51.53726 -0.44059 -12.03488 11.93883 -0.09605
magnitude: 1.28122 au
magnitude: 3.25660 debye
