program: Orca
programVersion: 5.0.2
elementType: Cl F F F O O O O O O O N C C C C C C C C C C C C C C C C C C C H H H H H H H H H H H H H H H
charge: 0
multiplicity: 1
keywords: wb97x-d3
keywords: def2-TZVPP
keywords: def2/J RIJCOSX
keywords: DEFGRID2
keywords: scfconv7
keywords: smallprint printgap noloewdin
keywords: NOSOSCF
formula: C19H15ClF3NO7
InChI: InChI=1/C19H15ClF3NO7/c1-3-29-17(25)10(2)30-18(26)13-9-12(5-6-15(13)24(27)28)31-16-7-4-11(8-14(16)20)19(21,22)23/h4-10H,3H2,1-2H3
46 atoms
Cl -1.646198 0.913727 2.035788
F  -6.24347 4.102513 0.432102
F  -4.893033 4.97943 1.857798
F  -4.930697 5.69103 -0.171639
O  2.62023 -2.628046 0.560902
O  -1.328167 0.600607 -0.896293
O  2.787736 -5.971096 -0.573387
O  3.048222 -2.456278 -1.632469
O  1.070996 -4.529446 -0.569891
O  4.708874 1.507239 0.324646
O  4.660964 -0.610918 0.075571
N  4.126842 0.476821 0.089628
C  2.018968 -0.642216 -0.483755
C  3.106377 -3.968077 0.585182
C  0.000531 0.643687 -0.648522
C  2.709777 0.529338 -0.18543
C  0.659918 -0.579185 -0.715027
C  0.695063 1.814249 -0.368441
C  2.657688 -1.992283 -0.596999
C  -2.149627 1.6200 -0.518411
C  2.054675 1.750382 -0.136552
C  -3.968435 3.577726 0.206034
C  3.086588 -4.424099 2.031778
C  -2.416106 1.863871 0.824513
C  -2.790762 2.362204 -1.49585
C  2.194931 -4.836381 -0.266673
C  -3.321562 2.845042 1.190267
C  -3.708032 3.333379 -1.137164
C  -5.004455 4.59128 0.58479
C  2.070374 -6.933259 -1.371149
C  2.144169 -6.60284 -2.842809
H  4.126796 -4.004378 0.194739
H  0.098589 -1.47898 -0.936226
H  0.197274 2.774276 -0.329926
H  2.594019 2.660298 0.084237
H  3.721101 -3.778192 2.637867
H  3.475451 -5.438146 2.108987
H  2.076822 -4.409659 2.442503
H  -2.580708 2.162837 -2.538589
H  -3.515271 3.014938 2.240668
H  -4.209336 3.892293 -1.916253
H  1.038411 -7.011551 -1.026578
H  2.564998 -7.880313 -1.162639
H  1.629789 -5.673427 -3.085451
H  1.666985 -7.403462 -3.409503
H  3.17778 -6.527022 -3.181334
elementType: Cl F O N C H
totalener: -2074.26557480 hartree
nucrepener: 3226.80607807 hartree
electener: -5301.07165287 hartree
oneelecener: -9267.27522030 hartree
twoeener: 3966.20356743 hartree
cpcmener: -0.03681189 hartree
kineticenergy: 2067.55177539 hartree
xcener: -165.656336032242 hartree
chargesum: -0.0000000
charge: -0.052391 -0.179472 -0.178759 -0.180313 -0.253510 -0.291579 -0.282792 -0.405960 -0.445755 -0.384793 -0.384870 0.565566 0.042286 0.155890 0.174931 -0.016956 -0.157836 -0.104811 0.426432 0.209686 -0.099871 -0.038618 -0.278573 0.040668 -0.167264 0.397138 -0.123289 -0.145846 0.557384 0.036846 -0.252837 0.114631 0.139027 0.160735 0.162084 0.106302 0.102979 0.106488 0.155469 0.135695 0.154355 0.093903 0.110480 0.091136 0.096338 0.089645
qa: -0.0524 -0.1795 -0.1788 -0.1803 -0.2535 -0.2916 -0.2828 -0.4060 -0.4458 -0.3848 -0.3849 0.5656 0.0423 0.1559 0.1749 -0.0170 -0.1578 -0.1048 0.4264 0.2097 -0.0999 -0.0386 -0.2786 0.0407 -0.1673 0.3971 -0.1233 -0.1458 0.5574 0.0368 -0.2528 0.1146 0.1390 0.1607 0.1621 0.1063 0.1030 0.1065 0.1555 0.1357 0.1544 0.0939 0.1105 0.0911 0.0963 0.0896
va: 1.2616 1.1112 1.1251 1.1211 2.1536 2.1291 2.1613 2.0962 2.0455 1.8837 1.8623 4.1171 3.8587 3.8374 3.8569 3.8996 4.0614 3.8964 4.2341 3.7900 4.0638 3.6993 3.9582 3.9897 3.9939 4.1056 4.0513 4.0093 4.4146 3.8481 3.9207 1.0204 1.0256 0.9967 1.0168 1.0051 1.0115 1.0039 1.0013 1.0258 1.0055 1.0096 0.9962 1.0136 1.0069 1.0044
dispcorr: -0.023331182 hartree
energy: -2074.288905982411
dipole: 32.62383 -33.92676 -1.30294 -51.67882 51.19971 -0.47911 -12.08533 12.03686 -0.04847
magnitude: 1.38908 au
magnitude: 3.53075 debye
