program: Orca
programVersion: 5.0.2
elementType: Cl F F F O O O O O O O N C C C C C C C C C C C C C C C C C C C H H H H H H H H H H H H H H H
charge: 0
multiplicity: 1
keywords: wb97x-d3
keywords: def2-TZVPP
keywords: def2/J RIJCOSX
keywords: DEFGRID2
keywords: scfconv7
keywords: smallprint printgap noloewdin
keywords: NOSOSCF
formula: C19H15ClF3NO7
InChI: InChI=1/C19H15ClF3NO7/c1-3-29-17(25)10(2)30-18(26)13-9-12(5-6-15(13)24(27)28)31-16-7-4-11(8-14(16)20)19(21,22)23/h4-10H,3H2,1-2H3
46 atoms
Cl -0.42024 2.372055 2.537332
F  -4.774076 -0.196918 -0.131008
F  -5.414742 1.310762 1.259271
F  -5.627361 1.637432 -0.854492
O  1.96951 -1.810357 0.52837
O  0.382614 3.267571 -0.142461
O  -0.273848 -4.403229 -0.354051
O  2.123267 -1.714282 -1.707018
O  -0.575427 -2.189597 -0.192922
O  4.728816 -1.176552 -0.35275
O  5.958374 0.566952 -0.404548
N  4.880349 0.025764 -0.364716
C  2.441292 0.25858 -0.413473
C  1.521151 -3.162216 0.483891
C  1.441485 2.429065 -0.211347
C  3.695011 0.849763 -0.328736
C  1.309509 1.053329 -0.356648
C  2.70056 3.017648 -0.135886
C  2.202419 -1.205358 -0.623402
C  -0.879596 2.747482 -0.087381
C  3.826075 2.226545 -0.195592
C  -3.449337 1.733513 0.030111
C  1.557989 -3.693669 1.904593
C  -1.395037 2.294253 1.121902
C  -1.651932 2.698309 -1.233197
C  0.105531 -3.175119 -0.072475
C  -2.67952 1.783794 1.185263
C  -2.939498 2.193529 -1.176558
C  -4.818838 1.12635 0.078091
C  -1.610915 -4.618634 -0.849342
C  -1.722522 -4.328308 -2.327014
H  2.175115 -3.761663 -0.15519
H  0.334797 0.587958 -0.431609
H  2.792653 4.089677 -0.023565
H  4.801558 2.68648 -0.128875
H  1.261147 -4.740684 1.921133
H  0.890587 -3.134586 2.560632
H  2.571379 -3.630652 2.299627
H  -1.243026 3.056608 -2.168695
H  -3.061103 1.429527 2.133663
H  -3.526989 2.160757 -2.083484
H  -2.32203 -4.029382 -0.268667
H  -1.805123 -5.670527 -0.647472
H  -2.727225 -4.591487 -2.660641
H  -1.014764 -4.923741 -2.904465
H  -1.563613 -3.275649 -2.55844
elementType: Cl F O N C H
totalener: -2074.26607731 hartree
nucrepener: 3388.01950068 hartree
electener: -5462.28557799 hartree
oneelecener: -9590.08624011 hartree
twoeener: 4127.80066212 hartree
cpcmener: -0.03551344 hartree
kineticenergy: 2067.54757845 hartree
xcener: -165.655389059587 hartree
chargesum: 0.0000000
charge: -0.053536 -0.178503 -0.179480 -0.179199 -0.254549 -0.295057 -0.286470 -0.403775 -0.447887 -0.386142 -0.385310 0.565932 0.033452 0.164292 0.222113 -0.023877 -0.127209 -0.189920 0.417199 0.187476 -0.072690 -0.024146 -0.279487 0.050768 -0.128437 0.406894 -0.149995 -0.147888 0.555224 0.038139 -0.252901 0.112867 0.143942 0.151676 0.159099 0.102361 0.106519 0.105612 0.156349 0.133052 0.153153 0.093545 0.110625 0.096035 0.089370 0.090766
qa: -0.0535 -0.1785 -0.1795 -0.1792 -0.2545 -0.2951 -0.2865 -0.4038 -0.4479 -0.3861 -0.3853 0.5659 0.0335 0.1643 0.2221 -0.0239 -0.1272 -0.1899 0.4172 0.1875 -0.0727 -0.0241 -0.2795 0.0508 -0.1284 0.4069 -0.1500 -0.1479 0.5552 0.0381 -0.2529 0.1129 0.1439 0.1517 0.1591 0.1024 0.1065 0.1056 0.1563 0.1331 0.1532 0.0935 0.1106 0.0960 0.0894 0.0908
va: 1.2617 1.1107 1.1237 1.1235 2.1549 2.1410 2.1629 2.1003 2.0381 1.8614 1.8820 4.1094 3.8692 3.8271 3.7971 3.8905 3.9424 4.0503 4.2595 3.8388 4.0426 3.6963 3.9634 3.9729 3.9761 4.0846 4.1036 3.9975 4.4177 3.8497 3.9188 1.0211 1.0167 1.0066 1.0145 1.0124 1.0026 1.0053 0.9994 1.0271 1.0065 1.0092 0.9962 1.0066 1.0046 1.0142
dispcorr: -0.024336188 hartree
energy: -2074.290413498098
dipole: 13.70742 -15.32949 -1.62207 -29.08605 29.40529 0.31924 -8.59500 8.93891 0.34391
magnitude: 1.68858 au
magnitude: 4.29202 debye
