program: Orca
programVersion: 5.0.2
elementType: Cl F F F O O O O O O O N C C C C C C C C C C C C C C C C C C C H H H H H H H H H H H H H H H
charge: 0
multiplicity: 1
keywords: wb97x-d3
keywords: def2-TZVPP
keywords: def2/J RIJCOSX
keywords: DEFGRID2
keywords: scfconv7
keywords: smallprint printgap noloewdin
keywords: NOSOSCF
formula: C19H15ClF3NO7
InChI: InChI=1/C19H15ClF3NO7/c1-3-29-17(25)10(2)30-18(26)13-9-12(5-6-15(13)24(27)28)31-16-7-4-11(8-14(16)20)19(21,22)23/h4-10H,3H2,1-2H3
46 atoms
Cl -0.357797 2.935551 -2.017049
F  -5.315256 1.290482 -1.496207
F  -4.579335 -0.614733 -0.820638
F  -5.61178 0.684688 0.547129
O  2.324277 -2.068564 0.667811
O  0.27537 2.861136 0.864392
O  -0.220038 -2.286104 0.356414
O  2.157395 -1.673883 -1.53769
O  -0.186408 -4.50068 0.013058
O  4.927282 -1.069491 -0.420624
O  5.988654 0.789527 -0.377445
N  4.982857 0.130629 -0.295454
C  2.538846 0.131285 -0.039219
C  1.874528 -3.406025 0.503425
C  1.39618 2.158128 0.557167
C  3.73777 0.825157 -0.014539
C  1.365628 0.806802 0.253085
C  2.602325 2.849415 0.582926
C  2.367732 -1.309095 -0.420645
C  -0.93628 2.330774 0.541895
C  3.771712 2.178681 0.295935
C  -3.428963 1.289363 -0.092726
C  2.229692 -4.166151 1.768528
C  -1.368148 2.307386 -0.782296
C  -1.756764 1.835177 1.540512
C  0.37255 -3.467986 0.250616
C  -2.61026 1.786126 -1.098223
C  -3.004256 1.319325 1.228186
C  -4.743608 0.667849 -0.464054
C  -1.636098 -2.214306 0.144242
C  -2.40214 -2.483861 1.419877
H  2.363464 -3.873501 -0.3559
H  0.433023 0.260189 0.244546
H  2.616161 3.903848 0.821466
H  4.714133 2.706084 0.310637
H  3.307219 -4.151925 1.923171
H  1.911139 -5.202062 1.67784
H  1.750221 -3.731922 2.645416
H  -1.413292 1.862074 2.566013
H  -2.925896 1.778252 -2.132485
H  -3.631447 0.939938 2.022504
H  -1.934743 -2.900057 -0.649064
H  -1.812791 -1.197232 -0.204033
H  -3.466179 -2.327948 1.24272
H  -2.091272 -1.80833 2.217195
H  -2.269102 -3.509816 1.759691
totalener: -2074.23983697 hartree
nucrepener: 3467.43949855 hartree
electener: -5541.67933552 hartree
oneelecener: -9746.91243856 hartree
twoeener: 4205.23310303 hartree
kineticenergy: 2067.61318136 hartree
xcener: -165.660833149025 hartree
chargesum: 0.0000000
charge: -0.020620 -0.165887 -0.167406 -0.169233 -0.246584 -0.284893 -0.270315 -0.309954 -0.354301 -0.332426 -0.338881 0.526291 0.029939 0.126292 0.149830 -0.070054 -0.060268 -0.151296 0.377624 0.168043 -0.064045 -0.085374 -0.265713 0.045078 -0.099043 0.339853 -0.119194 -0.168101 0.560066 0.051602 -0.267901 0.102944 0.092399 0.133865 0.151611 0.102546 0.106608 0.090249 0.137651 0.124661 0.138531 0.111660 0.060173 0.092801 0.077006 0.114166
qa: -0.0206 -0.1659 -0.1674 -0.1692 -0.2466 -0.2849 -0.2703 -0.3100 -0.3543 -0.3324 -0.3389 0.5263 0.0299 0.1263 0.1498 -0.0701 -0.0603 -0.1513 0.3776 0.1680 -0.0640 -0.0854 -0.2657 0.0451 -0.0990 0.3399 -0.1192 -0.1681 0.5601 0.0516 -0.2679 0.1029 0.0924 0.1339 0.1516 0.1025 0.1066 0.0902 0.1377 0.1247 0.1385 0.1117 0.0602 0.0928 0.0770 0.1142
va: 1.2961 1.1431 1.1170 1.1384 2.1443 2.1475 2.1195 2.1970 2.1623 1.9151 1.9229 4.1458 3.9498 3.8820 3.8627 3.9390 3.8994 4.0363 4.2926 3.8712 4.0668 3.7412 3.9564 4.0245 3.9443 4.1678 4.0427 3.9600 4.4040 3.8333 3.9075 1.0232 1.0349 1.0131 1.0212 1.0077 1.0152 1.0060 1.0075 1.0313 1.0136 1.0174 1.0093 1.0176 1.0015 1.0157
dispcorr: -0.028354438 hartree
energy: -2074.268191407049
dipole: 12.61209 -13.86295 -1.25086 -22.12395 23.47109 1.34715 18.16427 -16.53541 1.62886
magnitude: 2.45614 au
magnitude: 6.24302 debye
