program: Orca
programVersion: 5.0.2
elementType: Cl F F F O O O O O O O N C C C C C C C C C C C C C C C C C C C H H H H H H H H H H H H H H H
charge: 0
multiplicity: 1
keywords: wb97x-d3
keywords: def2-TZVPP
keywords: def2/J RIJCOSX
keywords: DEFGRID2
keywords: scfconv7
keywords: smallprint printgap noloewdin
keywords: NOSOSCF
formula: C19H15ClF3NO7
InChI: InChI=1/C19H15ClF3NO7/c1-3-29-17(25)10(2)30-18(26)13-9-12(5-6-15(13)24(27)28)31-16-7-4-11(8-14(16)20)19(21,22)23/h4-10H,3H2,1-2H3
46 atoms
Cl -0.447899 2.414535 2.362917
F  -5.375017 1.198138 1.253707
F  -5.775007 2.384067 -0.4985
F  -5.211639 0.323074 -0.707406
O  2.05158 -1.833896 0.60573
O  0.351603 3.194223 -0.369628
O  -0.099369 -4.472941 -0.363235
O  2.30644 -1.779486 -1.624309
O  -0.454803 -2.264605 -0.249841
O  4.835147 -1.119564 -0.110034
O  6.001221 0.670093 -0.240499
N  4.950976 0.079186 -0.205723
C  2.499716 0.229067 -0.37354
C  1.630043 -3.1846 0.544157
C  1.427475 2.373663 -0.32697
C  3.72901 0.862403 -0.270972
C  1.340564 0.990735 -0.3972
C  2.664763 3.003634 -0.233531
C  2.319241 -1.247383 -0.554963
C  -0.90939 2.691374 -0.273083
C  3.813875 2.246652 -0.205626
C  -3.54022 1.844986 -0.075715
C  1.61497 -3.722261 1.964789
C  -1.431601 2.319287 0.959767
C  -1.701005 2.619143 -1.408348
C  0.240562 -3.225624 -0.078903
C  -2.747875 1.896206 1.059344
C  -3.014712 2.20254 -1.311848
C  -4.980095 1.432045 0.001397
C  -1.392049 -4.695487 -0.94038
C  -1.529453 -6.175642 -1.202497
H  2.31599 -3.775191 -0.069922
H  0.383726 0.488942 -0.476751
H  2.713952 4.082243 -0.17737
H  4.77717 2.728077 -0.125487
H  1.31893 -4.769343 1.967907
H  0.923187 -3.163747 2.594838
H  2.610456 -3.651463 2.400314
H  -1.282388 2.90991 -2.362428
H  -3.136938 1.621084 2.029198
H  -3.624199 2.162823 -2.204581
H  -1.482783 -4.120826 -1.864239
H  -2.166477 -4.341704 -0.256179
H  -0.768688 -6.530847 -1.896824
H  -2.505007 -6.377501 -1.644152
H  -1.453253 -6.75525 -0.282879
totalener: -2074.24428601 hartree
nucrepener: 3347.04616093 hartree
electener: -5421.29044694 hartree
oneelecener: -9507.50723230 hartree
twoeener: 4086.21678536 hartree
kineticenergy: 2067.61113316 hartree
xcener: -165.659190924012 hartree
chargesum: 0.0000000
charge: -0.034794 -0.171441 -0.169662 -0.167608 -0.240744 -0.281717 -0.273051 -0.319768 -0.368089 -0.334760 -0.341135 0.524746 0.029785 0.154650 0.186222 -0.067216 -0.103515 -0.171047 0.370624 0.163481 -0.065978 -0.050173 -0.280619 0.049750 -0.122198 0.352850 -0.128686 -0.139978 0.550062 0.028317 -0.229811 0.102308 0.141723 0.131892 0.150797 0.096660 0.099040 0.103042 0.135319 0.130482 0.128236 0.092713 0.088450 0.088055 0.080341 0.082443
qa: -0.0348 -0.1714 -0.1697 -0.1676 -0.2407 -0.2817 -0.2731 -0.3198 -0.3681 -0.3348 -0.3411 0.5247 0.0298 0.1547 0.1862 -0.0672 -0.1035 -0.1710 0.3706 0.1635 -0.0660 -0.0502 -0.2806 0.0497 -0.1222 0.3528 -0.1287 -0.1400 0.5501 0.0283 -0.2298 0.1023 0.1417 0.1319 0.1508 0.0967 0.0990 0.1030 0.1353 0.1305 0.1282 0.0927 0.0885 0.0881 0.0803 0.0824
va: 1.2814 1.1366 1.1319 1.1347 2.1583 2.1455 2.1529 2.1839 2.1214 1.9119 1.9201 4.1475 3.9314 3.8528 3.8487 3.9493 3.9183 4.0544 4.2983 3.8859 4.0632 3.7948 3.9595 4.0116 3.9942 4.1264 4.0450 4.0697 4.4309 3.8750 3.9617 1.0243 1.0168 1.0144 1.0213 1.0135 1.0053 1.0071 1.0083 1.0284 1.0158 0.9984 0.9978 1.0050 1.0088 1.0050
dispcorr: -0.023636313 hartree
energy: -2074.267922323956
dipole: 15.12152 -16.36143 -1.23992 -35.49117 35.40568 -0.08549 -5.56668 5.79086 0.22418
magnitude: 1.26292 au
magnitude: 3.21008 debye
