program: Orca
programVersion: 5.0.2
elementType: Cl F F F O O O O O O O N C C C C C C C C C C C C C C C C C C C H H H H H H H H H H H H H H H
charge: 0
multiplicity: 1
keywords: wb97x-d3
keywords: def2-TZVPP
keywords: def2/J RIJCOSX
keywords: DEFGRID2
keywords: scfconv7
keywords: smallprint printgap noloewdin
keywords: NOSOSCF
formula: C19H15ClF3NO7
InChI: InChI=1/C19H15ClF3NO7/c1-3-29-17(25)10(2)30-18(26)13-9-12(5-6-15(13)24(27)28)31-16-7-4-11(8-14(16)20)19(21,22)23/h4-10H,3H2,1-2H3
46 atoms
Cl -0.47242 2.073301 2.603226
F  -4.735969 -0.622056 -0.057565
F  -5.418226 0.846293 1.354577
F  -5.669766 1.185189 -0.757034
O  2.421865 -1.979842 0.332325
O  0.257806 3.088041 -0.058033
O  -0.130241 -2.452939 0.21972
O  1.971371 -1.634241 -1.836695
O  0.140555 -4.537218 -0.568552
O  4.886321 -1.021261 -0.748653
O  5.967263 0.679902 -0.027809
N  4.950831 0.115526 -0.345782
C  2.493297 0.214863 -0.44893
C  2.064652 -3.350322 0.195379
C  1.366845 2.310031 -0.116647
C  3.705044 0.857979 -0.249633
C  1.320334 0.950096 -0.382194
C  2.585845 2.950067 0.07972
C  2.312613 -1.239167 -0.760782
C  -0.966053 2.494065 -0.006952
C  3.752773 2.220975 0.013036
C  -3.491396 1.356403 0.10782
C  2.407325 -4.042583 1.501633
C  -1.447384 1.983197 1.194962
C  -1.748744 2.428782 -1.146711
C  0.584559 -3.518406 -0.121992
C  -2.709394 1.417386 1.253421
C  -3.011535 1.863607 -1.091794
C  -4.837691 0.695808 0.163345
C  -1.532862 -2.465266 -0.070979
C  -1.810529 -2.069936 -1.504516
H  2.62261 -3.808195 -0.625461
H  0.377126 0.44382 -0.539751
H  2.610123 4.011712 0.283137
H  4.704093 2.709866 0.1624
H  3.4741 -3.958684 1.7040
H  2.156906 -5.099538 1.432662
H  1.860634 -3.61004 2.339074
H  -1.365269 2.830888 -2.074994
H  -3.068523 1.035861 2.199365
H  -3.611401 1.825431 -1.990127
H  -1.965369 -1.741325 0.618916
H  -1.956398 -3.444858 0.15466
H  -1.398269 -1.086861 -1.733943
H  -2.887477 -2.02475 -1.663927
H  -1.395971 -2.788637 -2.208949
totalener: -2074.24108085 hartree
nucrepener: 3466.58618549 hartree
electener: -5540.82726634 hartree
oneelecener: -9745.31364360 hartree
twoeener: 4204.48637725 hartree
kineticenergy: 2067.61342077 hartree
xcener: -165.659876793354 hartree
chargesum: -0.0000000
charge: -0.025954 -0.165694 -0.167108 -0.167339 -0.243100 -0.282718 -0.270704 -0.321071 -0.349653 -0.333004 -0.338257 0.524499 0.068680 0.130073 0.188269 -0.092999 -0.071402 -0.166453 0.371568 0.169304 -0.051770 -0.028732 -0.273820 0.072078 -0.101396 0.337941 -0.195678 -0.162005 0.553027 0.010789 -0.267593 0.105790 0.057068 0.133645 0.151419 0.102165 0.105410 0.095985 0.139148 0.127737 0.135950 0.092730 0.108612 0.076975 0.095121 0.122469
qa: -0.0260 -0.1657 -0.1671 -0.1673 -0.2431 -0.2827 -0.2707 -0.3211 -0.3497 -0.3330 -0.3383 0.5245 0.0687 0.1301 0.1883 -0.0930 -0.0714 -0.1665 0.3716 0.1693 -0.0518 -0.0287 -0.2738 0.0721 -0.1014 0.3379 -0.1957 -0.1620 0.5530 0.0108 -0.2676 0.1058 0.0571 0.1336 0.1514 0.1022 0.1054 0.0960 0.1391 0.1277 0.1359 0.0927 0.1086 0.0770 0.0951 0.1225
va: 1.2914 1.1190 1.1402 1.1401 2.1470 2.1480 2.1224 2.1852 2.1667 1.9099 1.9210 4.1398 3.8778 3.8530 3.8453 3.9655 3.9499 4.0471 4.2907 3.8695 4.0535 3.7079 3.9516 3.9836 3.9503 4.1930 4.0552 4.0138 4.4094 3.8414 3.9068 1.0236 1.0563 1.0142 1.0215 1.0074 1.0120 1.0069 1.0067 1.0319 1.0152 1.0039 1.0151 1.0014 1.0158 1.0156
dispcorr: -0.028256804 hartree
energy: -2074.269337658983
dipole: 15.42018 -16.57742 -1.15725 -18.48209 20.07789 1.59579 -6.64380 7.25934 0.61555
magnitude: 2.06511 au
magnitude: 5.24909 debye
