program: Orca
programVersion: 5.0.2
elementType: Cl F F F O O O O O O O N C C C C C C C C C C C C C C C C C C C H H H H H H H H H H H H H H H
charge: 0
multiplicity: 1
keywords: wb97x-d3
keywords: def2-TZVPP
keywords: def2/J RIJCOSX
keywords: DEFGRID2
keywords: scfconv7
keywords: smallprint printgap noloewdin
keywords: NOSOSCF
formula: C19H15ClF3NO7
InChI: InChI=1/C19H15ClF3NO7/c1-3-29-17(25)10(2)30-18(26)13-9-12(5-6-15(13)24(27)28)31-16-7-4-11(8-14(16)20)19(21,22)23/h4-10H,3H2,1-2H3
46 atoms
Cl -0.39786 3.358828 -1.714121
F  -5.941229 1.971074 0.447738
F  -5.395131 1.925886 -1.636117
F  -5.264765 0.138289 -0.443439
O  2.644274 -2.310946 0.047938
O  0.201599 2.711253 1.101865
O  0.365166 -3.463077 0.524109
O  1.413274 -1.615372 -1.693264
O  0.822587 -5.263958 -0.732417
O  4.677283 -0.943653 -1.197654
O  5.762935 0.096281 0.329074
N  4.753756 -0.168616 -0.275203
C  2.290067 -0.024039 -0.160694
C  2.5495 -3.663246 -0.378897
C  1.265336 1.953214 0.740345
C  3.53562 0.522036 0.1189
C  1.150407 0.70416 0.144708
C  2.516494 2.484889 1.03003
C  2.079777 -1.394168 -0.725682
C  -1.0531 2.371044 0.700092
C  3.650666 1.766698 0.718159
C  -3.658362 1.796303 -0.051007
C  3.521865 -4.468283 0.464219
C  -1.482993 2.645186 -0.592648
C  -1.928412 1.8031 1.612354
C  1.141244 -4.22012 -0.236338
C  -2.785858 2.35767 -0.969285
C  -3.229013 1.51976 1.241627
C  -5.071077 1.46119 -0.42971
C  -0.982238 -3.896433 0.740092
C  -1.07897 -4.929274 1.842098
H  2.821212 -3.744904 -1.434976
H  0.181476 0.274659 -0.073999
H  2.592019 3.461223 1.48842
H  4.626805 2.180237 0.925541
H  3.271805 -4.415493 1.523705
H  4.534829 -4.092354 0.328205
H  3.50002 -5.511305 0.155108
H  -1.583575 1.60022 2.617434
H  -3.100085 2.583416 -1.978367
H  -3.90357 1.085189 1.966766
H  -1.408401 -4.27481 -0.190175
H  -1.520354 -2.989373 1.013512
H  -2.12846 -5.142384 2.047636
H  -0.626513 -4.567062 2.765128
H  -0.600022 -5.865055 1.560332
totalener: -2074.24160731 hartree
nucrepener: 3340.13334848 hartree
electener: -5414.37495580 hartree
oneelecener: -9492.77971221 hartree
twoeener: 4078.40475641 hartree
kineticenergy: 2067.61356964 hartree
xcener: -165.657855649462 hartree
chargesum: -0.0000000
charge: -0.027118 -0.169429 -0.168587 -0.167025 -0.259874 -0.281695 -0.264971 -0.325388 -0.357591 -0.329051 -0.334720 0.508316 0.045740 0.130841 0.198177 -0.062249 -0.113854 -0.160912 0.373991 0.159110 -0.064846 -0.050673 -0.272563 0.048033 -0.125910 0.352185 -0.128859 -0.149433 0.551508 0.028236 -0.249677 0.105859 0.125665 0.133865 0.146867 0.093544 0.104530 0.106474 0.137252 0.133877 0.130724 0.093346 0.086913 0.085205 0.081801 0.102368
qa: -0.0271 -0.1694 -0.1686 -0.1670 -0.2599 -0.2817 -0.2650 -0.3254 -0.3576 -0.3291 -0.3347 0.5083 0.0457 0.1308 0.1982 -0.0622 -0.1139 -0.1609 0.3740 0.1591 -0.0648 -0.0507 -0.2726 0.0480 -0.1259 0.3522 -0.1289 -0.1494 0.5515 0.0282 -0.2497 0.1059 0.1257 0.1339 0.1469 0.0935 0.1045 0.1065 0.1373 0.1339 0.1307 0.0933 0.0869 0.0852 0.0818 0.1024
va: 1.2894 1.1341 1.1405 1.1328 2.1330 2.1417 2.1377 2.1856 2.1593 1.9079 1.9100 4.1186 3.8845 3.8604 3.8596 3.9231 3.9194 4.0517 4.2473 3.8740 4.0441 3.7855 3.9523 4.0175 3.9860 4.1791 4.0399 4.0569 4.4281 3.8849 3.9147 1.0246 1.0232 1.0133 1.0186 1.0060 1.0094 1.0144 1.0074 1.0276 1.0156 1.0106 0.9957 1.0103 1.0049 1.0128
dispcorr: -0.024203155 hartree
energy: -2074.265810469543
dipole: 21.83017 -22.65192 -0.82175 -35.49618 36.45305 0.95687 16.56437 -14.74146 1.82290
magnitude: 2.21672 au
magnitude: 5.63446 debye
