program: Orca
programVersion: 5.0.2
elementType: Cl F F F O O O O O O O N C C C C C C C C C C C C C C C C C C C H H H H H H H H H H H H H H H
charge: 0
multiplicity: 1
keywords: wb97x-d3
keywords: def2-TZVPP
keywords: def2/J RIJCOSX
keywords: DEFGRID2
keywords: scfconv7
keywords: smallprint printgap noloewdin
keywords: NOSOSCF
formula: C19H15ClF3NO7
InChI: InChI=1/C19H15ClF3NO7/c1-3-29-17(25)10(2)30-18(26)13-9-12(5-6-15(13)24(27)28)31-16-7-4-11(8-14(16)20)19(21,22)23/h4-10H,3H2,1-2H3
46 atoms
Cl -1.410825 1.552057 2.701006
F  -5.50997 2.534816 -1.753023
F  -4.785634 0.539856 -2.085962
F  -5.702739 1.048958 -0.205735
O  2.679608 -2.241878 -0.150719
O  0.248677 2.866882 0.670892
O  0.514166 -3.342901 0.78201
O  1.181839 -1.693123 -1.725055
O  0.745791 -5.207956 -0.443196
O  4.55365 -0.931477 -1.673754
O  5.746791 0.134449 -0.247048
N  4.697892 -0.137677 -0.775768
C  2.249767 0.019902 -0.473135
C  2.52352 -3.624693 -0.443833
C  1.293727 2.07239 0.333989
C  3.5134 0.576891 -0.324206
C  1.137269 0.780282 -0.151847
C  2.563239 2.609081 0.510789
C  1.986286 -1.391405 -0.892394
C  -0.997152 2.533635 0.232198
C  3.672164 1.858267 0.178957
C  -3.545278 1.891036 -0.64176
C  3.604536 -4.368173 0.31988
C  -1.896615 1.927466 1.09789
C  -1.375346 2.819575 -1.070805
C  1.149692 -4.148368 -0.054726
C  -3.176217 1.612719 0.663584
C  -2.644541 2.499062 -1.509165
C  -4.896677 1.502927 -1.16582
C  -0.781601 -3.744358 1.240908
C  -0.702409 -4.737515 2.380275
H  2.641096 -3.797781 -1.516934
H  0.155477 0.342336 -0.273127
H  2.67429 3.614464 0.893009
H  4.661517 2.278109 0.289094
H  4.588631 -4.01893 0.010841
H  3.537819 -5.433378 0.107604
H  3.506348 -4.221763 1.395351
H  -0.666574 3.294172 -1.736461
H  -3.862157 1.141773 1.353095
H  -2.92452 2.722993 -2.52949
H  -1.365034 -4.145711 0.410906
H  -1.252452 -2.818638 1.569842
H  -0.280017 -5.687616 2.058816
H  -1.705658 -4.932309 2.76063
H  -0.105291 -4.347798 3.204541
totalener: -2074.24113641 hartree
nucrepener: 3346.84739522 hartree
electener: -5421.08853163 hartree
oneelecener: -9506.20756152 hartree
twoeener: 4085.11902988 hartree
kineticenergy: 2067.61889834 hartree
xcener: -165.657819709578 hartree
chargesum: 0.0000000
charge: -0.035195 -0.169078 -0.163848 -0.170401 -0.261014 -0.283732 -0.265017 -0.331037 -0.356548 -0.327118 -0.333751 0.505205 0.037450 0.132864 0.208162 -0.057639 -0.117681 -0.165716 0.383113 0.153169 -0.064044 -0.054377 -0.273673 0.026728 -0.100457 0.350089 -0.133991 -0.135551 0.550348 0.027493 -0.250071 0.105619 0.128197 0.136242 0.146262 0.104252 0.106454 0.094944 0.139400 0.131174 0.130917 0.093727 0.088294 0.101074 0.084788 0.083972
qa: -0.0352 -0.1691 -0.1638 -0.1704 -0.2610 -0.2837 -0.2650 -0.3310 -0.3565 -0.3271 -0.3338 0.5052 0.0374 0.1329 0.2082 -0.0576 -0.1177 -0.1657 0.3831 0.1532 -0.0640 -0.0544 -0.2737 0.0267 -0.1005 0.3501 -0.1340 -0.1356 0.5503 0.0275 -0.2501 0.1056 0.1282 0.1362 0.1463 0.1043 0.1065 0.0949 0.1394 0.1312 0.1309 0.0937 0.0883 0.1011 0.0848 0.0840
va: 1.2801 1.1359 1.1370 1.1379 2.1360 2.1401 2.1385 2.1790 2.1602 1.9104 1.9083 4.1192 3.8775 3.8603 3.8685 3.9179 3.9326 4.0509 4.2297 3.9166 4.0394 3.7917 3.9493 3.9996 3.9838 4.1776 4.0225 4.0671 4.4315 3.8823 3.9166 1.0249 1.0251 1.0118 1.0179 1.0096 1.0136 1.0063 1.0031 1.0296 1.0155 1.0092 0.9970 1.0131 1.0105 1.0047
dispcorr: -0.024231526 hartree
energy: -2074.265367936415
dipole: 25.62639 -26.10192 -0.47553 -29.30274 30.65357 1.35083 8.13997 -7.01022 1.12975
magnitude: 1.82407 au
magnitude: 4.63641 debye
