program: Orca
programVersion: 5.0.2
elementType: Cl F F F O O O O O O O N C C C C C C C C C C C C C C C C C C C H H H H H H H H H H H H H H H
charge: 0
multiplicity: 1
keywords: wb97x-d3
keywords: def2-TZVPP
keywords: def2/J RIJCOSX
keywords: DEFGRID2
keywords: scfconv7
keywords: smallprint printgap noloewdin
keywords: NOSOSCF
formula: C19H15ClF3NO7
InChI: InChI=1/C19H15ClF3NO7/c1-3-29-17(25)10(2)30-18(26)13-9-12(5-6-15(13)24(27)28)31-16-7-4-11(8-14(16)20)19(21,22)23/h4-10H,3H2,1-2H3
46 atoms
Cl -0.526835 3.07273 -1.68056
F  -4.887385 -0.511879 -0.447218
F  -5.753151 0.913893 0.909425
F  -5.465431 1.432333 -1.161342
O  2.647271 -2.322344 0.117834
O  0.251175 2.614595 1.126733
O  0.204566 -3.215248 0.14109
O  1.779571 -1.57977 -1.814152
O  0.711202 -5.131836 -0.900071
O  4.835621 -0.99477 -1.045068
O  5.936513 0.343023 0.212948
N  4.911963 -0.077564 -0.263105
C  2.450152 -0.023446 -0.147615
C  2.495816 -3.673458 -0.298279
C  1.346734 1.905758 0.762628
C  3.671961 0.578498 0.117036
C  1.283043 0.649131 0.177007
C  2.575086 2.500853 1.027801
C  2.280645 -1.386248 -0.74697
C  -0.988295 2.15445 0.805215
C  3.736148 1.83384 0.705137
C  -3.551596 1.297727 0.201893
C  3.220402 -4.541234 0.714454
C  -1.49426 2.322329 -0.479597
C  -1.765077 1.554762 1.78194
C  1.035651 -4.089663 -0.405193
C  -2.775869 1.892535 -0.781923
C  -3.047503 1.130949 1.485085
C  -4.922759 0.787629 -0.127771
C  -1.196029 -3.498658 0.054446
C  -1.941086 -2.298249 0.586357
H  2.939799 -3.814156 -1.287911
H  0.332747 0.171732 -0.022589
H  2.610493 3.48314 1.478182
H  4.694448 2.292549 0.899393
H  4.275413 -4.273904 0.750331
H  3.143207 -5.58694 0.42426
H  2.800081 -4.427064 1.713492
H  -1.36086 1.434405 2.778033
H  -3.153067 2.034731 -1.78499
H  -3.644649 0.671699 2.260354
H  -1.424501 -4.39529 0.635147
H  -1.46851 -3.701957 -0.98285
H  -3.013443 -2.485201 0.547602
H  -1.742833 -1.408409 -0.011611
H  -1.674122 -2.086046 1.621609
totalener: -2074.24164971 hartree
nucrepener: 3416.97741133 hartree
electener: -5491.21906104 hartree
oneelecener: -9646.21197577 hartree
twoeener: 4154.99291473 hartree
kineticenergy: 2067.62565175 hartree
xcener: -165.661078559034 hartree
chargesum: 0.0000000
charge: -0.022516 -0.164488 -0.168885 -0.167354 -0.251067 -0.282210 -0.263710 -0.319275 -0.351080 -0.331761 -0.336836 0.517716 0.057344 0.128240 0.227467 -0.082361 -0.117617 -0.174935 0.365211 0.171064 -0.053405 -0.050103 -0.269708 0.041890 -0.111335 0.340310 -0.127497 -0.169326 0.549822 0.040427 -0.249464 0.105339 0.095966 0.133518 0.150071 0.102423 0.107140 0.093225 0.136265 0.128966 0.133798 0.092667 0.094852 0.094732 0.072270 0.084212
qa: -0.0225 -0.1645 -0.1689 -0.1674 -0.2511 -0.2822 -0.2637 -0.3193 -0.3511 -0.3318 -0.3368 0.5177 0.0573 0.1282 0.2275 -0.0824 -0.1176 -0.1749 0.3652 0.1711 -0.0534 -0.0501 -0.2697 0.0419 -0.1113 0.3403 -0.1275 -0.1693 0.5498 0.0404 -0.2495 0.1053 0.0960 0.1335 0.1501 0.1024 0.1071 0.0932 0.1363 0.1290 0.1338 0.0927 0.0949 0.0947 0.0723 0.0842
va: 1.2948 1.1239 1.1366 1.1411 2.1332 2.1493 2.1394 2.1914 2.1708 1.9076 1.9169 4.1288 3.8826 3.8675 3.8114 3.9368 3.9656 4.0565 4.2833 3.8544 4.0439 3.7366 3.9575 4.0143 3.9581 4.1861 4.0587 3.9959 4.4197 3.8943 3.9490 1.0227 1.0307 1.0142 1.0206 1.0082 1.0141 1.0055 1.0073 1.0297 1.0162 0.9991 1.0015 1.0159 1.0009 1.0013
dispcorr: -0.027041918 hartree
energy: -2074.268691626674
dipole: 18.17373 -19.22543 -1.05170 -25.50365 26.61817 1.11453 12.13234 -10.34316 1.78918
magnitude: 2.35572 au
magnitude: 5.98776 debye
