program: Orca
programVersion: 5.0.2
elementType: Cl F F F O O O O O O O N C C C C C C C C C C C C C C C C C C C H H H H H H H H H H H H H H H
charge: 0
multiplicity: 1
keywords: wb97x-d3
keywords: def2-TZVPP
keywords: def2/J RIJCOSX
keywords: DEFGRID2
keywords: scfconv7
keywords: smallprint printgap noloewdin
keywords: NOSOSCF
formula: C19H15ClF3NO7
InChI: InChI=1/C19H15ClF3NO7/c1-3-29-17(25)10(2)30-18(26)13-9-12(5-6-15(13)24(27)28)31-16-7-4-11(8-14(16)20)19(21,22)23/h4-10H,3H2,1-2H3
46 atoms
Cl -1.312075 1.799962 2.861915
F  -5.318802 0.076374 -0.235868
F  -5.862511 2.155826 -0.186484
F  -5.238695 1.253434 -2.037202
O  2.862828 -2.30576 -0.032636
O  0.268819 2.744486 0.5955
O  0.722523 -3.46209 0.908153
O  1.324056 -1.904146 -1.612171
O  1.031764 -5.336007 -0.2871
O  4.620184 -1.026624 -1.714289
O  5.834735 0.206022 -0.449881
N  4.773332 -0.155739 -0.891924
C  2.338122 -0.082874 -0.475523
C  2.768469 -3.706911 -0.261677
C  1.327895 1.974221 0.249356
C  3.580389 0.536343 -0.427228
C  1.207621 0.647155 -0.144136
C  2.578777 2.57542 0.32449
C  2.126222 -1.525661 -0.808763
C  -0.988641 2.35423 0.250522
C  3.704049 1.853536 -0.014964
C  -3.586053 1.645785 -0.406759
C  3.844979 -4.372429 0.576116
C  -1.860117 1.910429 1.239516
C  -1.417889 2.432955 -1.062753
C  1.39733 -4.260521 0.094916
C  -3.159276 1.564225 0.912552
C  -2.714908 2.080444 -1.394168
C  -5.006943 1.280721 -0.724558
C  -0.602521 -3.854699 1.280641
C  -1.613566 -3.516011 0.206607
H  2.935611 -3.923873 -1.320221
H  0.241955 0.160595 -0.183385
H  2.661109 3.607472 0.636149
H  4.676919 2.321957 0.018223
H  3.699103 -4.182702 1.63903
H  4.827429 -4.000716 0.288644
H  3.825668 -5.447706 0.409994
H  -0.733546 2.777705 -1.826585
H  -3.824489 1.225003 1.695333
H  -3.032385 2.149488 -2.42431
H  -0.806456 -3.297264 2.194083
H  -0.627093 -4.919048 1.519595
H  -1.444031 -4.090331 -0.702062
H  -1.58572 -2.456283 -0.045662
H  -2.61599 -3.748534 0.567123
totalener: -2074.24148116 hartree
nucrepener: 3359.18343633 hartree
electener: -5433.42491750 hartree
oneelecener: -9530.80353617 hartree
twoeener: 4097.37861867 hartree
kineticenergy: 2067.61443589 hartree
xcener: -165.657610847226 hartree
chargesum: -0.0000000
charge: -0.032197 -0.169711 -0.166096 -0.169167 -0.258412 -0.281364 -0.264069 -0.332088 -0.354020 -0.327552 -0.333126 0.506801 0.062845 0.131927 0.216566 -0.064097 -0.134846 -0.174408 0.375329 0.143637 -0.058952 -0.054423 -0.274129 0.028726 -0.095138 0.344606 -0.159127 -0.117414 0.550653 0.009688 -0.237305 0.105216 0.128298 0.136606 0.146810 0.096666 0.103802 0.106195 0.140902 0.118785 0.144002 0.098145 0.092921 0.105611 0.074256 0.088649
qa: -0.0322 -0.1697 -0.1661 -0.1692 -0.2584 -0.2814 -0.2641 -0.3321 -0.3540 -0.3276 -0.3331 0.5068 0.0628 0.1319 0.2166 -0.0641 -0.1348 -0.1744 0.3753 0.1436 -0.0590 -0.0544 -0.2741 0.0287 -0.0951 0.3446 -0.1591 -0.1174 0.5507 0.0097 -0.2373 0.1052 0.1283 0.1366 0.1468 0.0967 0.1038 0.1062 0.1409 0.1188 0.1440 0.0981 0.0929 0.1056 0.0743 0.0886
va: 1.2838 1.1341 1.1346 1.1394 2.1370 2.1426 2.1366 2.1762 2.1631 1.9094 1.9103 4.1185 3.8312 3.8467 3.8618 3.9275 3.9531 4.0518 4.2455 3.9139 4.0375 3.7879 3.9518 3.9983 3.9788 4.1978 4.1128 3.9868 4.4317 3.8825 3.9167 1.0245 1.0174 1.0119 1.0181 1.0063 1.0086 1.0126 1.0025 1.0342 1.0112 0.9948 1.0119 1.0129 1.0059 1.0096
dispcorr: -0.024838987 hartree
energy: -2074.266320151424
dipole: 24.27624 -24.77624 -0.50000 -26.43914 27.82471 1.38557 0.79023 0.08879 0.87902
magnitude: 1.71537 au
magnitude: 4.36011 debye
