program: Orca
programVersion: 5.0.2
elementType: Cl F F F O O O O O O O N C C C C C C C C C C C C C C C C C C C H H H H H H H H H H H H H H H
charge: 0
multiplicity: 1
keywords: wb97x-d3
keywords: def2-TZVPP
keywords: def2/J RIJCOSX
keywords: DEFGRID2
keywords: scfconv7
keywords: smallprint printgap noloewdin
keywords: NOSOSCF
formula: C19H15ClF3NO7
InChI: InChI=1/C19H15ClF3NO7/c1-3-29-17(25)10(2)30-18(26)13-9-12(5-6-15(13)24(27)28)31-16-7-4-11(8-14(16)20)19(21,22)23/h4-10H,3H2,1-2H3
46 atoms
Cl -0.898276 1.371681 2.323819
F  -5.409184 1.715417 -2.0639
F  -5.038636 -0.025243 -0.849688
F  -5.789553 1.774526 0.053733
O  2.627109 -2.221886 -0.066106
O  0.317354 2.986274 0.173298
O  0.246418 -3.047698 0.513416
O  1.512144 -1.66308 -1.929649
O  0.510957 -5.045875 -0.472805
O  4.822349 -1.044218 -1.233682
O  5.793814 0.079447 0.310846
N  4.840098 -0.198698 -0.372781
C  2.386969 0.044688 -0.530417
C  2.399758 -3.6039 -0.309188
C  1.3703 2.141641 0.053918
C  3.621216 0.568129 -0.169202
C  1.260135 0.845648 -0.430966
C  2.606202 2.648501 0.437251
C  2.146815 -1.368633 -0.959108
C  -0.941939 2.547448 -0.097866
C  3.73139 1.860433 0.320116
C  -3.545452 1.761018 -0.627275
C  3.280756 -4.382559 0.650823
C  -1.64947 1.800854 0.841766
C  -1.538279 2.887878 -1.297661
C  0.938599 -3.984141 -0.117209
C  -2.949447 1.412186 0.578838
C  -2.841587 2.499926 -1.564378
C  -4.953608 1.308881 -0.879369
C  -1.143761 -3.288666 0.756763
C  -1.369103 -4.133102 1.99171
H  2.663931 -3.85604 -1.339773
H  0.303626 0.436166 -0.72759
H  2.679235 3.659778 0.812945
H  4.698375 2.254911 0.596242
H  4.327783 -4.137013 0.480777
H  3.149145 -5.449971 0.486544
H  3.037278 -4.159024 1.689148
H  -0.977855 3.466331 -2.019612
H  -3.48738 0.839262 1.32266
H  -3.291352 2.775823 -2.50692
H  -1.604234 -3.745992 -0.12025
H  -1.573005 -2.295447 0.886618
H  -2.438911 -4.206849 2.189116
H  -0.899589 -3.686837 2.867941
H  -0.985684 -5.143714 1.863747
totalener: -2074.24150409 hartree
nucrepener: 3386.52464080 hartree
electener: -5460.76614489 hartree
oneelecener: -9585.46521154 hartree
twoeener: 4124.69906666 hartree
kineticenergy: 2067.61992037 hartree
xcener: -165.659324897565 hartree
chargesum: 0.0000000
charge: -0.032074 -0.168820 -0.168289 -0.167633 -0.258546 -0.283012 -0.265138 -0.331137 -0.356646 -0.327196 -0.335326 0.506165 0.050332 0.130950 0.222355 -0.071007 -0.132287 -0.171258 0.381922 0.167086 -0.057432 -0.045795 -0.272320 0.036264 -0.107086 0.350367 -0.174325 -0.118206 0.552828 0.034936 -0.249647 0.104042 0.126538 0.133801 0.146273 0.104509 0.106189 0.094254 0.137086 0.118586 0.144794 0.093766 0.080173 0.084978 0.083502 0.101485
qa: -0.0321 -0.1688 -0.1683 -0.1676 -0.2585 -0.2830 -0.2651 -0.3311 -0.3566 -0.3272 -0.3353 0.5062 0.0503 0.1309 0.2224 -0.0710 -0.1323 -0.1713 0.3819 0.1671 -0.0574 -0.0458 -0.2723 0.0363 -0.1071 0.3504 -0.1743 -0.1182 0.5528 0.0349 -0.2496 0.1040 0.1265 0.1338 0.1463 0.1045 0.1062 0.0943 0.1371 0.1186 0.1448 0.0938 0.0802 0.0850 0.0835 0.1015
va: 1.2829 1.1401 1.1340 1.1359 2.1352 2.1435 2.1362 2.1787 2.1601 1.9108 1.9087 4.1210 3.8909 3.8680 3.8537 3.9348 3.9362 4.0620 4.2297 3.8684 4.0359 3.7836 3.9514 3.9937 3.9971 4.1732 4.1117 3.9785 4.4327 3.8859 3.9187 1.0250 1.0267 1.0132 1.0186 1.0091 1.0139 1.0062 1.0078 1.0340 1.0106 1.0102 0.9948 1.0103 1.0047 1.0129
dispcorr: -0.024951023 hartree
energy: -2074.266455115220
dipole: 21.32748 -22.10506 -0.77758 -25.87250 27.38569 1.51319 6.22609 -5.35024 0.87584
magnitude: 1.91350 au
magnitude: 4.86372 debye
