program: Orca
programVersion: 5.0.2
elementType: Cl F F F O O O O O O O N C C C C C C C C C C C C C C C C C C C H H H H H H H H H H H H H H H
charge: 0
multiplicity: 1
keywords: wb97x-d3
keywords: def2-TZVPP
keywords: def2/J RIJCOSX
keywords: DEFGRID2
keywords: scfconv7
keywords: smallprint printgap noloewdin
keywords: NOSOSCF
formula: C19H15ClF3NO7
InChI: InChI=1/C19H15ClF3NO7/c1-3-29-17(25)10(2)30-18(26)13-9-12(5-6-15(13)24(27)28)31-16-7-4-11(8-14(16)20)19(21,22)23/h4-10H,3H2,1-2H3
46 atoms
Cl -1.149575 1.127281 2.4388
F  -5.955612 2.601565 -0.297562
F  -5.377268 1.635194 -2.129019
F  -5.560342 0.487309 -0.316795
O  2.793017 -2.04115 -0.200323
O  0.14228 2.988519 0.536359
O  0.685166 -3.052228 0.889458
O  1.250589 -1.567876 -1.754759
O  0.811528 -4.982037 -0.250142
O  4.661791 -0.656499 -1.646455
O  5.737059 0.386712 -0.112621
N  4.731396 0.111876 -0.7188
C  2.266974 0.199773 -0.536526
C  2.618721 -3.435106 -0.418906
C  1.215482 2.217006 0.237089
C  3.505722 0.790864 -0.325554
C  1.11802 0.928559 -0.270245
C  2.45999 2.788457 0.474149
C  2.05749 -1.224506 -0.940221
C  -1.112108 2.59658 0.182416
C  3.604394 2.073954 0.187391
C  -3.721528 1.944451 -0.49029
C  3.731088 -4.150331 0.326035
C  -1.85685 1.759843 1.00654
C  -1.672721 3.089554 -0.983741
C  1.258015 -3.915339 0.064453
C  -3.162107 1.438293 0.673718
C  -2.97513 2.76941 -1.320597
C  -5.159209 1.659549 -0.812752
C  -0.60798 -3.374113 1.412108
C  -0.532893 -4.322111 2.589444
H  2.680158 -3.663002 -1.486356
H  0.156998 0.465097 -0.449165
H  2.523698 3.793164 0.868822
H  4.574975 2.521423 0.345359
H  3.649823 -5.223435 0.164966
H  3.685124 -3.955567 1.397215
H  4.700911 -3.821309 -0.044331
H  -1.083528 3.737338 -1.618868
H  -3.72636 0.791893 1.331417
H  -3.397272 3.166894 -2.232751
H  -1.239921 -3.781117 0.62113
H  -1.021762 -2.413234 1.717412
H  -1.529123 -4.451908 3.013299
H  0.112663 -3.928386 3.374277
H  -0.167747 -5.303843 2.294229
totalener: -2074.24114463 hartree
nucrepener: 3362.45201257 hartree
electener: -5436.69315720 hartree
oneelecener: -9537.36729660 hartree
twoeener: 4100.67413940 hartree
kineticenergy: 2067.61612457 hartree
xcener: -165.658062770700 hartree
chargesum: -0.0000000
charge: -0.038910 -0.163704 -0.168630 -0.169999 -0.261098 -0.282966 -0.265111 -0.334508 -0.355247 -0.324792 -0.334111 0.502020 0.041534 0.131229 0.240693 -0.064012 -0.143614 -0.179229 0.386137 0.180633 -0.057755 -0.044759 -0.273141 0.008879 -0.111624 0.348822 -0.129850 -0.125521 0.542916 0.031678 -0.248957 0.105170 0.132346 0.134288 0.145434 0.105925 0.095372 0.104727 0.135363 0.124153 0.136696 0.093497 0.080205 0.084562 0.083747 0.101515
qa: -0.0389 -0.1637 -0.1686 -0.1700 -0.2611 -0.2830 -0.2651 -0.3345 -0.3552 -0.3248 -0.3341 0.5020 0.0415 0.1312 0.2407 -0.0640 -0.1436 -0.1792 0.3861 0.1806 -0.0578 -0.0448 -0.2731 0.0089 -0.1116 0.3488 -0.1299 -0.1255 0.5429 0.0317 -0.2490 0.1052 0.1323 0.1343 0.1454 0.1059 0.0954 0.1047 0.1354 0.1242 0.1367 0.0935 0.0802 0.0846 0.0837 0.1015
va: 1.2745 1.1319 1.1381 1.1368 2.1359 2.1412 2.1337 2.1733 2.1618 1.9138 1.9057 4.1224 3.8976 3.8676 3.8614 3.9351 3.9578 4.0645 4.2156 3.8731 4.0305 3.7868 3.9489 3.9953 4.0189 4.1699 4.0634 4.0303 4.4329 3.8846 3.9175 1.0252 1.0247 1.0130 1.0173 1.0131 1.0065 1.0096 1.0067 1.0316 1.0136 1.0088 0.9994 1.0105 1.0047 1.0136
dispcorr: -0.024723398 hartree
energy: -2074.265868025479
dipole: 26.58313 -27.14391 -0.56078 -26.99147 28.41200 1.42053 7.82470 -6.77876 1.04593
magnitude: 1.85104 au
magnitude: 4.70498 debye
