program: Orca
programVersion: 5.0.2
elementType: Cl F F F O O O O O O O N C C C C C C C C C C C C C C C C C C C H H H H H H H H H H H H H H H
charge: 0
multiplicity: 1
keywords: wb97x-d3
keywords: def2-TZVPP
keywords: def2/J RIJCOSX
keywords: DEFGRID2
keywords: scfconv7
keywords: smallprint printgap noloewdin
keywords: NOSOSCF
formula: C19H15ClF3NO7
InChI: InChI=1/C19H15ClF3NO7/c1-3-29-17(25)10(2)30-18(26)13-9-12(5-6-15(13)24(27)28)31-16-7-4-11(8-14(16)20)19(21,22)23/h4-10H,3H2,1-2H3
46 atoms
Cl -0.292748 2.341463 2.254638
F  -5.190461 0.720062 1.437473
F  -5.761408 2.594893 0.553913
F  -5.589879 0.843306 -0.677457
O  1.913227 -1.832594 0.727589
O  0.279788 3.075412 -0.57121
O  0.216828 -4.714538 -0.420582
O  2.497959 -1.960494 -1.434333
O  -0.396148 -2.55685 -0.475631
O  4.817973 -1.103315 0.211788
O  5.962533 0.643294 -0.262578
N  4.920677 0.059004 -0.101633
C  2.472917 0.152359 -0.345519
C  1.584611 -3.211685 0.733557
C  1.368687 2.276653 -0.46728
C  3.690499 0.812676 -0.273921
C  1.303244 0.890454 -0.442722
C  2.594477 2.931659 -0.416911
C  2.338287 -1.337317 -0.427606
C  -0.97236 2.597153 -0.342337
C  3.75543 2.197648 -0.321501
C  -3.599091 1.820899 0.10149
C  1.308519 -3.602023 2.174746
C  -1.391908 2.251026 0.93875
C  -1.868266 2.537903 -1.396853
C  0.355409 -3.427858 -0.138993
C  -2.702428 1.862369 1.158634
C  -3.180497 2.15953 -1.178055
C  -5.039484 1.486514 0.355282
C  -0.877371 -5.106799 -1.259098
C  -0.565277 -4.892724 -2.724194
H  2.415045 -3.802855 0.337459
H  0.354794 0.370048 -0.504568
H  2.626166 4.012171 -0.44012
H  4.710463 2.699048 -0.26757
H  2.189578 -3.416357 2.787291
H  1.069916 -4.662138 2.238441
H  0.475763 -3.032731 2.586699
H  -1.530746 2.80851 -2.388231
H  -3.007021 1.601252 2.162438
H  -3.866227 2.127496 -2.013109
H  -1.78395 -4.573716 -0.968326
H  -1.021886 -6.16485 -1.044293
H  0.339593 -5.423917 -3.017603
H  -0.4386 -3.837511 -2.959189
H  -1.388382 -5.273974 -3.329222
totalener: -2074.24345648 hartree
nucrepener: 3354.58259091 hartree
electener: -5428.82604740 hartree
oneelecener: -9522.52849873 hartree
twoeener: 4093.70245133 hartree
kineticenergy: 2067.61217988 hartree
xcener: -165.659874209945 hartree
chargesum: -0.0000000
charge: -0.033658 -0.170806 -0.165403 -0.170711 -0.240458 -0.282222 -0.275240 -0.321025 -0.371131 -0.332251 -0.338743 0.520417 0.034786 0.149469 0.180611 -0.053877 -0.107375 -0.164649 0.364419 0.172313 -0.070514 -0.043623 -0.282702 0.038752 -0.136936 0.354973 -0.129828 -0.126888 0.542182 0.022474 -0.244812 0.104266 0.141946 0.132253 0.149688 0.102282 0.097369 0.100596 0.134868 0.125434 0.134815 0.089007 0.098919 0.087464 0.101987 0.081560
qa: -0.0337 -0.1708 -0.1654 -0.1707 -0.2405 -0.2822 -0.2752 -0.3210 -0.3711 -0.3323 -0.3387 0.5204 0.0348 0.1495 0.1806 -0.0539 -0.1074 -0.1646 0.3644 0.1723 -0.0705 -0.0436 -0.2827 0.0388 -0.1369 0.3550 -0.1298 -0.1269 0.5422 0.0225 -0.2448 0.1043 0.1419 0.1323 0.1497 0.1023 0.0974 0.1006 0.1349 0.1254 0.1348 0.0890 0.0989 0.0875 0.1020 0.0816
va: 1.2814 1.1356 1.1294 1.1348 2.1647 2.1433 2.1546 2.1792 2.1129 1.9141 1.9202 4.1399 3.9239 3.8550 3.8527 3.9334 3.8969 4.0495 4.2896 3.8684 4.0649 3.7879 3.9556 4.0148 4.0135 4.1292 4.0784 4.0353 4.4329 3.8840 3.9185 1.0224 1.0191 1.0137 1.0206 1.0071 1.0126 1.0057 1.0096 1.0303 1.0140 1.0106 0.9948 1.0062 1.0133 1.0086
dispcorr: -0.023988744 hartree
energy: -2074.267445228164
dipole: 17.11158 -18.29786 -1.18628 -32.69374 32.74166 0.04792 -10.88628 10.90046 0.01418
magnitude: 1.18733 au
magnitude: 3.01795 debye
