program: Orca
programVersion: 5.0.2
elementType: Cl F F F O O O O O O O N C C C C C C C C C C C C C C C C C C C H H H H H H H H H H H H H H H
charge: 0
multiplicity: 1
keywords: wb97x-d3
keywords: def2-TZVPP
keywords: def2/J RIJCOSX
keywords: DEFGRID2
keywords: scfconv7
keywords: smallprint printgap noloewdin
keywords: NOSOSCF
formula: C19H15ClF3NO7
InChI: InChI=1/C19H15ClF3NO7/c1-3-29-17(25)10(2)30-18(26)13-9-12(5-6-15(13)24(27)28)31-16-7-4-11(8-14(16)20)19(21,22)23/h4-10H,3H2,1-2H3
46 atoms
Cl -0.488908 2.943169 -1.866824
F  -5.472583 1.359655 -0.818305
F  -4.591407 -0.595532 -0.856073
F  -5.38117 0.188345 0.986967
O  2.40376 -2.215379 0.37681
O  0.377932 2.701464 0.935667
O  -0.141043 -2.426831 -0.051958
O  2.296789 -1.635886 -1.789112
O  -0.000942 -4.50988 -0.869494
O  5.038422 -1.148317 -0.548082
O  6.109421 0.691705 -0.318271
N  5.096971 0.037475 -0.324344
C  2.646576 0.036355 -0.137287
C  1.958335 -3.530739 0.076639
C  1.496415 2.01424 0.592691
C  3.847601 0.717501 -0.027107
C  1.467707 0.692302 0.179038
C  2.705094 2.69551 0.696172
C  2.480928 -1.366415 -0.640436
C  -0.842781 2.15497 0.680426
C  3.878689 2.043394 0.386123
C  -3.364946 1.107599 0.189464
C  2.138034 -4.36468 1.332821
C  -1.38695 2.215546 -0.600909
C  -1.561813 1.567407 1.705532
C  0.498562 -3.549007 -0.358261
C  -2.646004 1.696225 -0.844528
C  -2.823638 1.045967 1.46496
C  -4.711297 0.51719 -0.117902
C  -1.53111 -2.329115 -0.389843
C  -2.412433 -2.949431 0.671205
H  2.543568 -3.958603 -0.741406
H  0.534169 0.152022 0.104764
H  2.717267 3.727992 1.016708
H  4.82234 2.56293 0.46448
H  3.187255 -4.385446 1.623271
H  1.816341 -5.38722 1.146238
H  1.557856 -3.964372 2.164051
H  -1.130698 1.52777 2.696864
H  -3.053425 1.758774 -1.844872
H  -3.370659 0.594643 2.280005
H  -1.713019 -2.777984 -1.366808
H  -1.720044 -1.258966 -0.47004
H  -2.222131 -2.509115 1.650252
H  -2.265404 -4.025995 0.737121
H  -3.45807 -2.771838 0.422628
totalener: -2074.24026295 hartree
nucrepener: 3462.71000122 hartree
electener: -5536.95026417 hartree
oneelecener: -9737.44249358 hartree
twoeener: 4200.49222941 hartree
kineticenergy: 2067.60400241 hartree
xcener: -165.658629561695 hartree
chargesum: -0.0000000
charge: -0.019684 -0.165038 -0.170264 -0.171618 -0.245672 -0.282023 -0.275111 -0.309252 -0.350159 -0.332481 -0.339103 0.526808 0.038952 0.127103 0.178040 -0.075265 -0.080436 -0.167435 0.371249 0.158273 -0.058916 -0.101375 -0.270716 0.047592 -0.090530 0.338048 -0.131620 -0.138929 0.568645 0.071146 -0.271655 0.107808 0.093440 0.133500 0.151929 0.102508 0.105850 0.092274 0.137107 0.120871 0.138855 0.107083 0.045170 0.079694 0.111953 0.093384
qa: -0.0197 -0.1650 -0.1703 -0.1716 -0.2457 -0.2820 -0.2751 -0.3093 -0.3502 -0.3325 -0.3391 0.5268 0.0390 0.1271 0.1780 -0.0753 -0.0804 -0.1674 0.3712 0.1583 -0.0589 -0.1014 -0.2707 0.0476 -0.0905 0.3380 -0.1316 -0.1389 0.5686 0.0711 -0.2717 0.1078 0.0934 0.1335 0.1519 0.1025 0.1058 0.0923 0.1371 0.1209 0.1389 0.1071 0.0452 0.0797 0.1120 0.0934
va: 1.2977 1.1437 1.1189 1.1365 2.1477 2.1503 2.1198 2.1962 2.1667 1.9150 1.9226 4.1444 3.9357 3.8753 3.8519 3.9475 3.9330 4.0496 4.2976 3.8819 4.0604 3.7536 3.9507 4.0089 3.9546 4.1664 4.0537 3.9391 4.3955 3.8478 3.9079 1.0222 1.0353 1.0140 1.0212 1.0076 1.0136 1.0069 1.0070 1.0331 1.0139 1.0165 1.0100 1.0028 1.0161 1.0194
dispcorr: -0.028167609 hartree
energy: -2074.268430556687
dipole: 12.75292 -14.04450 -1.29159 -23.74849 24.93069 1.18220 13.50571 -11.70280 1.80291
magnitude: 2.51322 au
magnitude: 6.38811 debye
