program: Gaussian 09
title: 000056632
version: EM64L-G09RevD.01
frameworkgroup: C1[X(C16H16O3)]
method: RPBEPBE
basis: SDD
operation: Freq
keyword: #pfreq=noraman
keyword: PBEPBE/SDD
title: #p freq=noraman PBEPBE/SDD
converged: YES YES NO NO
title: Mulliken charges:
elementType: O O O C C C C C C C C C C C C C C C C H H H H H H H H H H H H H H H H
charge: -0.271662 -0.422539 -0.231155 0.022910 0.168352 0.407275 0.191841 -0.558599 -0.311493 -0.424377 -0.688865 -0.689255 0.008247 0.348621 -0.335949 -0.361156 -0.244772 -0.236608 -0.233096 0.194709 0.229423 0.271750 0.255903 0.205708 0.236665 0.228609 0.214579 0.241951 0.234415 0.241910 0.268304 0.225420 0.228427 0.228011 0.356496
chargesum: 0.00000
title: Mulliken charges with hydrogens summed into heavy atoms:
elementType: O O O C C C C C C C C C C C C C C C C
charge: -0.271662 -0.066043 -0.231155 0.217619 0.168352 0.407275 0.191841 -0.329175 -0.039743 -0.168474 -0.017883 0.001690 0.008247 0.348621 -0.094040 -0.092852 -0.019352 -0.008181 -0.005085
polarizability: 2.95253132e+02 5.05970820e+00 1.73860768e+02 -1.40415310e+01 3.82074424e+00 1.16949329e+02
1716.lowfreq: -9.4859 -0.0004 0.0001 0.0004 1.4636 3.1383 29.2479 39.5973 45.8717
frequency: 29.1402 39.5923 45.8490 78.9284 87.4221 111.8157 128.4059 169.6186 189.2405 195.5932 221.4818 223.6131 238.1958 272.6687 319.3181 320.2586 344.2320 363.4376 403.1624 405.5718 430.6519 450.6865 466.4592 490.2069 529.9923 554.7656 606.6325 613.7210 629.4466 678.4974 690.9181 699.8851 709.7798 739.1907 795.4167 810.3683 820.6943 834.3387 857.0430 896.0975 917.7245 927.6021 941.9532 943.5387 964.6463 975.9822 984.8885 990.3882 1000.5661 1025.7881 1072.0916 1083.6527 1106.1583 1146.2788 1152.5520 1155.6544 1171.1422 1171.9749 1184.9395 1187.9232 1263.4727 1279.6054 1293.2903 1317.2496 1318.3641 1345.5477 1383.0804 1385.1502 1386.0577 1401.1700 1421.0051 1433.9649 1456.0159 1468.9382 1470.6381 1477.7846 1488.8230 1496.8272 1525.6962 1580.5798 1590.9514 1608.6582 1616.9159 2974.6965 2990.0496 2996.9410 3086.5961 3094.2589 3098.5031 3105.1912 3123.4927 3133.3472 3135.0037 3147.4814 3155.2102 3157.1222 3167.0499 3179.5018 3574.8877
redmass: 4.9538 4.7877 4.1152 3.6415 3.5003 5.4469 4.0536 5.7629 1.0644 4.2111 4.6844 4.1493 1.2541 4.3618 2.8241 1.9482 2.1505 3.3792 3.4119 3.5874 2.7912 3.1329 3.8298 3.4270 7.5219 5.8174 5.9074 6.3535 4.2494 3.5394 4.3240 1.7994 5.0719 2.2171 1.8138 2.5890 3.8049 1.6837 1.2462 3.0824 4.5032 1.2618 1.4668 1.4066 1.6416 2.4591 1.4008 6.0612 1.3334 2.1938 2.3248 1.5957 1.7236 1.3823 1.6694 2.7056 1.7060 1.0566 1.4918 1.4768 3.0533 2.8551 1.6090 1.3460 1.3389 1.3863 1.9960 2.5384 5.5758 1.2488 4.6247 2.3410 1.0498 1.0548 1.0514 2.2744 1.0642 2.8117 9.5962 6.9042 6.5305 6.0483 6.8548 1.0844 1.0360 1.0362 1.0992 1.1004 1.0995 1.1005 1.0848 1.0907 1.0882 1.0926 1.0886 1.0961 1.1008 1.0966 1.0661
irintensity: 0.3401 1.3252 0.0829 0.2861 0.6954 3.9379 0.4434 0.5937 0.4927 1.8925 0.1318 0.8465 0.2309 11.5679 14.0867 41.8227 23.0577 26.4461 0.5259 4.9542 6.2764 10.2972 3.7819 9.2987 4.5846 5.2315 33.1242 0.5608 21.1517 14.5576 9.6640 51.1993 3.1310 26.6600 19.2597 24.7389 24.4996 50.8385 2.4490 30.5423 34.4275 2.8516 2.3487 3.2030 47.8680 39.6516 1.3547 0.9664 1.1930 8.3725 178.7251 16.8543 98.5365 34.1523 8.9531 41.9456 77.9115 0.1600 136.2764 40.2065 187.8343 263.4765 154.4987 12.9831 3.7902 3.7477 17.4564 18.4683 7.6981 31.2999 67.4993 27.7000 6.0697 4.7699 5.2043 6.6025 13.7280 13.0140 190.1638 88.3444 21.6188 57.2214 344.5623 27.8032 15.6146 24.4434 19.0127 23.1282 36.8738 32.8883 0.1151 12.6757 7.9737 26.4487 0.3148 25.0596 23.2109 4.5878 29.7146
temp: 298.150 k
press: 1.00000 atm
elementType: 8 8 8 6 6 6 6 6 6 6 6 6 6 6 6 6 6 6 6 1 1 1 1 1 1 1 1 1 1 1 1 1 1 1 1
symmnumber: 1
zpe: 728088.6 jmol-1
zpe.correction: 0.277314 hartree
zpe.thermalcorrener: 0.295174 hartree
zpe.thermalcorrenthalpy: 0.296118 hartree
zpe.thermalcorrgfe: 0.230833 hartree
zpe.sumelectzpe: -843.597182 hartree
zpe.sumelectthermal: -843.579322 hartree
zpe.sumelectthermalent: -843.578378 hartree
zpe.sumelectthermalfe: -843.643663 hartree
dipole: 3.9137 -5.5409 0.1852
dipole: 6.7862
quadrupole: -93.4076 -109.9570 -111.5235
quadrupole: 0.8603 3.3256 -2.9640
quadrupole: 11.5551 -4.9943 -6.5608 0.8603 3.3256 -2.9640
hfenergy: -843.8744966 hartree
pointgroup: C01 [X(C16H16O3)]
dipole: 1.5163642 -1.6369136 1.4660936 debye
polarizability: 293.2798961|-13.0154162|152.892586|-20.1779119|-26.8522909|139.8907467 unknown
InChI: InChI=1S/C16H16O3/c1-11(2)19-13-8-9-14(15(17)10-13)16(18)12-6-4-3-5-7-12/h3-11,17H,1-2H3
charge 0 multiplicity 1
35 atoms
O  3.907163 -0.408164 -0.839104
O  -0.376476 -0.288365 1.617018
O  -1.954187 2.065101 -1.324658
C  4.661666 -1.0301 0.290688
C  -0.235272 0.542443 -0.654955
C  2.552696 -0.104971 -0.694562
C  0.39478 -0.068181 0.464368
C  1.774375 -0.392016 0.453793
C  0.591464 0.85431 -1.772346
C  1.952666 0.531832 -1.813994
C  5.88861 -1.672138 -0.363617
C  5.02523 0.041306 1.333655
C  -1.668545 0.98351 -0.714556
C  -2.7742 0.143671 -0.143087
C  -2.661973 -1.264795 -0.012305
C  -4.002119 0.776503 0.185448
C  -3.759417 -2.027283 0.439825
C  -5.091985 0.017792 0.657241
C  -4.974087 -1.387768 0.783365
H  4.025398 -1.819963 0.741676
H  2.221839 -0.850817 1.342608
H  0.119352 1.366828 -2.616445
H  2.57167 0.7553 -2.686681
H  6.511897 -2.171337 0.399798
H  5.582987 -2.419774 -1.11481
H  6.498809 -0.902847 -0.867831
H  5.573363 -0.417871 2.176703
H  4.131157 0.54721 1.736905
H  5.673695 0.807959 0.874584
H  -1.722939 -1.76034 -0.280003
H  -4.079262 1.861089 0.055746
H  -3.671501 -3.116347 0.523391
H  -6.032338 0.514565 0.92064
H  -5.823926 -1.980208 1.141534
H  0.17391 -0.671034 2.344868
