program: Orca
programVersion: 5.0.2
elementType: Cl F F F O O O O O O O N C C C C C C C C C C C C C C C C C C C H H H H H H H H H H H H H H H
charge: 0
multiplicity: 1
keywords: wb97x-d3
keywords: def2-TZVPP
keywords: def2/J RIJCOSX
keywords: DEFGRID2
keywords: scfconv7
keywords: smallprint printgap noloewdin
keywords: NOSOSCF
formula: C19H15ClF3NO7
InChI: InChI=1/C19H15ClF3NO7/c1-3-29-17(25)10(2)30-18(26)13-9-12(5-6-15(13)24(27)28)31-16-7-4-11(8-14(16)20)19(21,22)23/h4-10H,3H2,1-2H3
46 atoms
Cl -0.906913 1.638693 2.66561
F  -4.493232 -0.694861 -1.095027
F  -5.47601 0.641268 0.272562
F  -5.261734 1.188479 -1.798026
O  2.432899 -2.144088 0.265738
O  0.40179 2.836624 0.325404
O  -0.117457 -2.34404 0.034505
O  2.191253 -1.774277 -1.937268
O  -0.119574 -4.569323 -0.231854
O  5.000992 -1.190373 -0.859308
O  6.098879 0.64459 -0.754305
N  5.078065 0.005357 -0.707901
C  2.631095 0.046866 -0.477832
C  1.970356 -3.480981 0.13378
C  1.512176 2.101658 0.068558
C  3.841148 0.720737 -0.443854
C  1.463693 0.746765 -0.219187
C  2.731146 2.771407 0.108669
C  2.44192 -1.398474 -0.831865
C  -0.81813 2.293009 0.058427
C  3.893086 2.077519 -0.149904
C  -3.323601 1.23311 -0.471275
C  2.377218 -4.232229 1.388471
C  -1.560488 1.715759 1.082129
C  -1.328915 2.329347 -1.22865
C  0.458436 -3.535387 -0.052701
C  -2.817909 1.195619 0.819915
C  -2.578216 1.800074 -1.496886
C  -4.648814 0.597245 -0.772144
C  -1.541321 -2.264739 -0.108454
C  -2.237088 -2.439822 1.222688
H  2.418691 -3.958503 -0.742095
H  0.522547 0.215906 -0.241568
H  2.759711 3.827577 0.338325
H  4.843756 2.589538 -0.127264
H  1.948173 -3.781067 2.282873
H  3.461413 -4.232764 1.488865
H  2.039273 -5.264222 1.325329
H  -0.74192 2.778082 -2.018953
H  -3.383254 0.757426 1.630861
H  -2.960477 1.835694 -2.50719
H  -1.890472 -2.996475 -0.83722
H  -1.725478 -1.270249 -0.513149
H  -2.09222 -3.44273 1.622044
H  -3.308758 -2.286779 1.094083
H  -1.8771 -1.717173 1.955956
totalener: -2074.24006782 hartree
nucrepener: 3470.56057967 hartree
electener: -5544.80064749 hartree
oneelecener: -9753.08144744 hartree
twoeener: 4208.28079995 hartree
kineticenergy: 2067.61935602 hartree
xcener: -165.661947573613 hartree
chargesum: -0.0000000
charge: -0.027607 -0.166465 -0.168522 -0.165973 -0.244790 -0.283120 -0.268720 -0.313879 -0.354835 -0.332653 -0.339536 0.527314 0.025540 0.127196 0.204811 -0.076408 -0.080814 -0.177638 0.380835 0.165407 -0.055879 -0.070084 -0.265100 0.068180 -0.100988 0.340088 -0.213076 -0.110092 0.558778 0.041481 -0.262500 0.101833 0.081442 0.134938 0.152044 0.091620 0.102174 0.105978 0.140909 0.129911 0.136881 0.112854 0.068387 0.113650 0.091805 0.074622
qa: -0.0276 -0.1665 -0.1685 -0.1660 -0.2448 -0.2831 -0.2687 -0.3139 -0.3548 -0.3327 -0.3395 0.5273 0.0255 0.1272 0.2048 -0.0764 -0.0808 -0.1776 0.3808 0.1654 -0.0559 -0.0701 -0.2651 0.0682 -0.1010 0.3401 -0.2131 -0.1101 0.5588 0.0415 -0.2625 0.1018 0.0814 0.1349 0.1520 0.0916 0.1022 0.1060 0.1409 0.1299 0.1369 0.1129 0.0684 0.1137 0.0918 0.0746
va: 1.2875 1.1187 1.1390 1.1429 2.1457 2.1530 2.1202 2.1948 2.1616 1.9141 1.9223 4.1467 3.9523 3.8779 3.8307 3.9492 3.9586 4.0513 4.2959 3.9134 4.0571 3.7317 3.9570 3.9478 3.9950 4.1736 4.0279 3.9958 4.4070 3.8214 3.9064 1.0234 1.0427 1.0133 1.0215 1.0060 1.0075 1.0155 1.0035 1.0286 1.0132 1.0180 1.0066 1.0163 1.0164 1.0045
dispcorr: -0.028626246 hartree
energy: -2074.268694067722
dipole: 14.87648 -15.99247 -1.11599 -18.25929 19.83146 1.57217 3.85310 -3.03716 0.81594
magnitude: 2.09354 au
magnitude: 5.32136 debye
