program: Orca
programVersion: 5.0.2
elementType: Cl F F F O O O O O O O N C C C C C C C C C C C C C C C C C C C H H H H H H H H H H H H H H H
charge: 0
multiplicity: 1
keywords: wb97x-d3
keywords: def2-TZVPP
keywords: def2/J RIJCOSX
keywords: DEFGRID2
keywords: scfconv7
keywords: smallprint printgap noloewdin
keywords: NOSOSCF
formula: C19H15ClF3NO7
InChI: InChI=1/C19H15ClF3NO7/c1-3-29-17(25)10(2)30-18(26)13-9-12(5-6-15(13)24(27)28)31-16-7-4-11(8-14(16)20)19(21,22)23/h4-10H,3H2,1-2H3
46 atoms
Cl -0.401943 1.830621 2.448043
F  -4.959538 0.016842 0.718011
F  -5.440675 1.114833 -1.074373
F  -4.227723 -0.653354 -1.189638
O  2.074702 -1.810005 0.292341
O  0.388938 3.239124 -0.029554
O  -0.828019 -3.801359 -0.116855
O  2.190333 -1.524601 -1.934795
O  -0.529409 -1.585314 -0.129088
O  4.866879 -1.062307 -0.4460
O  6.049137 0.698758 -0.154959
N  4.995585 0.128888 -0.29111
C  2.555307 0.325313 -0.483151
C  1.37871 -3.036212 0.163736
C  1.489392 2.448894 -0.126767
C  3.78305 0.926165 -0.259138
C  1.408358 1.098227 -0.427116
C  2.725215 3.051109 0.084733
C  2.308153 -1.115617 -0.819875
C  -0.827723 2.625925 -0.089184
C  3.869944 2.286246 0.013364
C  -3.232129 1.263587 -0.286898
C  1.619215 -3.839006 1.430153
C  -1.312622 1.904628 0.996198
C  -1.571226 2.699075 -1.255025
C  -0.096591 -2.701425 -0.045053
C  -2.509416 1.216575 0.894096
C  -2.774162 2.024651 -1.354973
C  -4.472478 0.438051 -0.451419
C  -2.242005 -3.651024 -0.317559
C  -2.975349 -3.315292 0.962707
H  1.734497 -3.599808 -0.704458
H  0.456226 0.617763 -0.60134
H  2.782006 4.10653 0.312635
H  4.834181 2.742671 0.181511
H  1.126546 -4.806441 1.366816
H  1.24834 -3.317909 2.312399
H  2.686796 -4.010262 1.558279
H  -1.188045 3.271905 -2.088682
H  -2.852225 0.639448 1.740728
H  -3.335594 2.08017 -2.277321
H  -2.564075 -4.616469 -0.704521
H  -2.431461 -2.896746 -1.082096
H  -4.047289 -3.291751 0.766054
H  -2.690496 -2.338206 1.348329
H  -2.793781 -4.0625 1.734698
totalener: -2074.24122282 hartree
nucrepener: 3494.62939980 hartree
electener: -5568.87062263 hartree
oneelecener: -9802.61882765 hartree
twoeener: 4233.74820503 hartree
kineticenergy: 2067.61464909 hartree
xcener: -165.662643727112 hartree
chargesum: -0.0000000
charge: -0.034735 -0.177189 -0.169259 -0.172334 -0.246673 -0.288685 -0.280488 -0.318617 -0.399818 -0.337703 -0.342037 0.526355 0.024371 0.147544 0.206943 -0.077663 -0.127629 -0.175826 0.388821 0.178839 -0.055812 -0.024949 -0.272353 0.060924 -0.115118 0.397301 -0.161044 -0.146983 0.562535 0.028696 -0.263986 0.100548 0.138277 0.131572 0.150414 0.096256 0.093775 0.104348 0.135065 0.119073 0.130622 0.103635 0.090594 0.093499 0.083247 0.095649
qa: -0.0347 -0.1772 -0.1693 -0.1723 -0.2467 -0.2887 -0.2805 -0.3186 -0.3998 -0.3377 -0.3420 0.5264 0.0244 0.1475 0.2069 -0.0777 -0.1276 -0.1758 0.3888 0.1788 -0.0558 -0.0249 -0.2724 0.0609 -0.1151 0.3973 -0.1610 -0.1470 0.5625 0.0287 -0.2640 0.1005 0.1383 0.1316 0.1504 0.0963 0.0938 0.1043 0.1351 0.1191 0.1306 0.1036 0.0906 0.0935 0.0832 0.0956
va: 1.2815 1.1276 1.1377 1.1152 2.1447 2.1498 2.1560 2.1895 2.0844 1.9102 1.9205 4.1477 3.9295 3.8680 3.8401 3.9442 3.9219 4.0678 4.3010 3.8862 4.0508 3.7671 3.9645 3.9998 3.9859 4.0741 4.0647 4.0576 4.3912 3.8664 3.9202 1.0255 1.0316 1.0136 1.0217 1.0153 1.0055 1.0075 1.0078 1.0308 1.0147 0.9964 1.0164 1.0118 1.0119 1.0075
dispcorr: -0.027560390 hartree
energy: -2074.268783212457
dipole: 8.00130 -9.62523 -1.62393 -21.66577 21.81755 0.15178 1.72182 -1.18205 0.53977
magnitude: 1.71800 au
magnitude: 4.36682 debye
