program: Orca
programVersion: 5.0.2
elementType: Cl F F F O O O O O O O N C C C C C C C C C C C C C C C C C C C H H H H H H H H H H H H H H H
charge: 0
multiplicity: 1
keywords: wb97x-d3
keywords: def2-TZVPP
keywords: def2/J RIJCOSX
keywords: DEFGRID2
keywords: scfconv7
keywords: smallprint printgap noloewdin
keywords: NOSOSCF
formula: C19H15ClF3NO7
InChI: InChI=1/C19H15ClF3NO7/c1-3-29-17(25)10(2)30-18(26)13-9-12(5-6-15(13)24(27)28)31-16-7-4-11(8-14(16)20)19(21,22)23/h4-10H,3H2,1-2H3
46 atoms
Cl -0.495987 2.214664 2.406692
F  -5.403948 0.937747 1.08007
F  -5.542875 0.944759 -1.06711
F  -4.66885 -0.734169 -0.049795
O  2.452883 -2.136733 0.497113
O  0.363262 2.916678 -0.312539
O  -0.097876 -2.610719 0.368557
O  2.050064 -1.953832 -1.701805
O  0.183811 -4.742422 -0.279332
O  6.041125 0.450799 -0.064329
O  4.940442 -1.296217 -0.629398
N  5.018344 -0.128281 -0.3316
C  2.562452 -0.009369 -0.44658
C  2.090854 -3.511784 0.462087
C  1.460141 2.119256 -0.294187
C  3.780769 0.634078 -0.299181
C  1.397096 0.742053 -0.439382
C  2.686633 2.758851 -0.144824
C  2.37266 -1.481783 -0.651532
C  -0.870286 2.342715 -0.254833
C  3.844579 2.013334 -0.145469
C  -3.409969 1.239796 -0.125321
C  2.387577 -4.090977 1.833444
C  -1.40988 1.975612 0.974327
C  -1.600967 2.1499 -1.414257
C  0.620079 -3.698561 0.112973
C  -2.67982 1.430421 1.040002
C  -2.87057 1.598697 -1.353078
C  -4.765312 0.601596 -0.04204
C  -1.490525 -2.627539 0.035567
C  -1.718557 -2.287509 -1.420883
H  2.671958 -4.038441 -0.299304
H  0.448474 0.234153 -0.551778
H  2.722495 3.83342 -0.030392
H  4.80154 2.500725 -0.031528
H  3.447606 -3.991572 2.062854
H  2.134744 -5.14954 1.848282
H  1.816014 -3.586161 2.611816
H  -1.171251 2.439894 -2.364071
H  -3.087174 1.164341 2.005755
H  -3.429445 1.458767 -2.267591
H  -1.940339 -1.874691 0.682192
H  -1.9276 -3.595189 0.285329
H  -1.298218 -1.313615 -1.673708
H  -2.789536 -2.248737 -1.618723
H  -1.280143 -3.032327 -2.082551
totalener: -2074.24091664 hartree
nucrepener: 3462.93337860 hartree
electener: -5537.17429524 hartree
oneelecener: -9737.99512257 hartree
twoeener: 4200.82082734 hartree
kineticenergy: 2067.61440740 hartree
xcener: -165.659806965070 hartree
chargesum: 0.0000000
charge: -0.026602 -0.167537 -0.166886 -0.166157 -0.242112 -0.282782 -0.270913 -0.320422 -0.348167 -0.338372 -0.332862 0.525325 0.064361 0.129986 0.194612 -0.091867 -0.070084 -0.168893 0.368954 0.171252 -0.052473 -0.031416 -0.274302 0.067927 -0.097386 0.336269 -0.185289 -0.171219 0.554168 0.012177 -0.266526 0.106461 0.053827 0.133666 0.151673 0.102111 0.105010 0.096526 0.140145 0.126479 0.137007 0.092856 0.108205 0.074408 0.094874 0.123989
qa: -0.0266 -0.1675 -0.1669 -0.1662 -0.2421 -0.2828 -0.2709 -0.3204 -0.3482 -0.3384 -0.3329 0.5253 0.0644 0.1300 0.1946 -0.0919 -0.0701 -0.1689 0.3690 0.1713 -0.0525 -0.0314 -0.2743 0.0679 -0.0974 0.3363 -0.1853 -0.1712 0.5542 0.0122 -0.2665 0.1065 0.0538 0.1337 0.1517 0.1021 0.1050 0.0965 0.1401 0.1265 0.1370 0.0929 0.1082 0.0744 0.0949 0.1240
va: 1.2906 1.1394 1.1411 1.1189 2.1477 2.1497 2.1224 2.1858 2.1680 1.9211 1.9105 4.1401 3.8822 3.8504 3.8402 3.9655 3.9550 4.0492 4.2942 3.8686 4.0549 3.7074 3.9513 3.9876 3.9409 4.1968 4.0653 4.0071 4.4105 3.8404 3.9077 1.0232 1.0593 1.0145 1.0215 1.0074 1.0118 1.0071 1.0059 1.0325 1.0151 1.0047 1.0154 1.0013 1.0157 1.0150
dispcorr: -0.028230801 hartree
energy: -2074.269147440299
dipole: 15.55937 -16.70547 -1.14610 -19.31060 20.94631 1.63572 -4.86308 5.33979 0.47671
magnitude: 2.05338 au
magnitude: 5.21928 debye
