program: Orca
programVersion: 5.0.2
elementType: Cl F F F O O O O O O O N C C C C C C C C C C C C C C C C C C C H H H H H H H H H H H H H H H
charge: 0
multiplicity: 1
keywords: wb97x-d3
keywords: def2-TZVPP
keywords: def2/J RIJCOSX
keywords: DEFGRID2
keywords: scfconv7
keywords: smallprint printgap noloewdin
keywords: NOSOSCF
formula: C19H15ClF3NO7
InChI: InChI=1/C19H15ClF3NO7/c1-3-29-17(25)10(2)30-18(26)13-9-12(5-6-15(13)24(27)28)31-16-7-4-11(8-14(16)20)19(21,22)23/h4-10H,3H2,1-2H3
46 atoms
Cl -1.244612 2.705154 2.894845
F  -5.515156 2.221793 -1.101732
F  -4.942142 0.16737 -1.351462
F  -5.543524 0.886597 0.587231
O  2.442634 -2.142549 0.427254
O  0.431355 2.801046 0.527942
O  0.14119 -4.672186 -0.477473
O  2.320298 -1.838257 -1.793729
O  -0.174623 -2.498772 -0.026796
O  5.049874 -1.163181 -0.754255
O  6.045024 0.708647 -1.053191
N  5.073656 0.04393 -0.793995
C  2.650551 0.033357 -0.371193
C  2.005802 -3.483117 0.284834
C  1.520438 2.078578 0.17417
C  3.836631 0.742206 -0.486383
C  1.487423 0.705361 -0.028002
C  2.712962 2.784287 0.051166
C  2.495836 -1.422929 -0.687491
C  -0.822244 2.349941 0.261541
C  3.871412 2.113121 -0.275058
C  -3.442393 1.575514 -0.224443
C  2.220702 -4.177389 1.618568
C  -1.738839 2.293839 1.303662
C  -1.220096 2.00899 -1.023854
C  0.530561 -3.466514 -0.096372
C  -3.050572 1.917801 1.058881
C  -2.522603 1.619385 -1.265883
C  -4.866444 1.208001 -0.517308
C  -1.234553 -4.855919 -0.836504
C  -2.121819 -5.043176 0.374607
H  2.57435 -3.993836 -0.4974
H  0.567738 0.143011 0.077119
H  2.724521 3.852358 0.218986
H  4.802612 2.652632 -0.365935
H  3.275689 -4.149695 1.886947
H  1.916521 -5.220089 1.553373
H  1.650822 -3.697931 2.414033
H  -0.507585 2.053432 -1.837272
H  -3.746493 1.8866 1.885157
H  -2.812518 1.353874 -2.273189
H  -1.235754 -5.749869 -1.458474
H  -1.574608 -4.017642 -1.44608
H  -3.136316 -5.270588 0.04642
H  -2.166563 -4.144101 0.986485
H  -1.780299 -5.87312 0.992952
totalener: -2074.24326004 hartree
nucrepener: 3330.54177178 hartree
electener: -5404.78503181 hartree
oneelecener: -9474.31160770 hartree
twoeener: 4069.52657588 hartree
kineticenergy: 2067.60968381 hartree
xcener: -165.659937016598 hartree
chargesum: -0.0000000
charge: -0.036746 -0.166535 -0.171356 -0.171938 -0.243906 -0.282768 -0.274984 -0.318303 -0.380853 -0.331780 -0.338674 0.522549 0.042047 0.149912 0.223221 -0.069216 -0.157033 -0.184561 0.370261 0.194840 -0.059691 -0.060317 -0.279761 0.000738 -0.142700 0.366009 -0.118197 -0.119284 0.544985 0.027902 -0.253802 0.104260 0.162889 0.136254 0.151590 0.103825 0.097356 0.099400 0.143484 0.126173 0.130600 0.101975 0.091812 0.087136 0.099515 0.083673
qa: -0.0367 -0.1665 -0.1714 -0.1719 -0.2439 -0.2828 -0.2750 -0.3183 -0.3809 -0.3318 -0.3387 0.5225 0.0420 0.1499 0.2232 -0.0692 -0.1570 -0.1846 0.3703 0.1948 -0.0597 -0.0603 -0.2798 0.0007 -0.1427 0.3660 -0.1182 -0.1193 0.5450 0.0279 -0.2538 0.1043 0.1629 0.1363 0.1516 0.1038 0.0974 0.0994 0.1435 0.1262 0.1306 0.1020 0.0918 0.0871 0.0995 0.0837
va: 1.2796 1.1299 1.1325 1.1348 2.1583 2.1469 2.1583 2.1841 2.0970 1.9156 1.9217 4.1433 3.8998 3.8477 3.8726 3.9570 3.9491 4.0463 4.3045 3.8707 4.0449 3.7947 3.9542 4.0246 3.9831 4.1133 4.0265 4.0593 4.4326 3.8738 3.9155 1.0237 1.0061 1.0120 1.0208 1.0071 1.0138 1.0056 0.9988 1.0309 1.0152 0.9950 1.0104 1.0105 1.0114 1.0051
dispcorr: -0.023595437 hartree
energy: -2074.266855473409
dipole: 17.03449 -17.96502 -0.93053 -34.56572 34.22499 -0.34073 -0.15138 0.73885 0.58747
magnitude: 1.15200 au
magnitude: 2.92814 debye
