program: Orca
programVersion: 5.0.2
elementType: Cl F F F O O O O O O O N C C C C C C C C C C C C C C C C C C C H H H H H H H H H H H H H H H
charge: 0
multiplicity: 1
keywords: wb97x-d3
keywords: def2-TZVPP
keywords: def2/J RIJCOSX
keywords: DEFGRID2
keywords: scfconv7
keywords: smallprint printgap noloewdin
keywords: NOSOSCF
formula: C19H15ClF3NO7
InChI: InChI=1/C19H15ClF3NO7/c1-3-29-17(25)10(2)30-18(26)13-9-12(5-6-15(13)24(27)28)31-16-7-4-11(8-14(16)20)19(21,22)23/h4-10H,3H2,1-2H3
46 atoms
Cl -0.329821 2.917758 -1.93067
F  -5.305772 0.183101 0.801492
F  -5.463685 1.630393 -0.785119
F  -4.570245 -0.285939 -1.167742
O  2.438135 -2.130977 0.710372
O  0.398978 2.824776 0.922199
O  0.035685 -4.582465 -0.145559
O  2.179496 -1.746591 -1.485628
O  -0.211025 -2.428128 0.423639
O  4.985449 -1.146368 -0.467947
O  6.062049 0.703337 -0.434366
N  5.052102 0.052762 -0.335458
C  2.615326 0.069995 -0.015049
C  1.966054 -3.457236 0.551113
C  1.50076 2.105105 0.594486
C  3.819823 0.755282 -0.02439
C  1.450481 0.750703 0.300275
C  2.712567 2.787954 0.587481
C  2.43286 -1.37156 -0.380567
C  -0.826084 2.298584 0.643206
C  3.870824 2.11017 0.277252
C  -3.327706 1.248456 0.089977
C  2.242826 -4.196337 1.848711
C  -1.301245 2.282259 -0.666425
C  -1.607177 1.795887 1.66649
C  0.471287 -3.400806 0.259639
C  -2.548462 1.757156 -0.941943
C  -2.862335 1.274555 1.394161
C  -4.673955 0.68894 -0.25843
C  -1.360332 -4.72284 -0.44291
C  -1.703933 -4.202773 -1.821675
H  2.476703 -3.954137 -0.278488
H  0.515272 0.20518 0.315855
H  2.736607 3.84388 0.818684
H  4.816061 2.632352 0.265298
H  3.312295 -4.202087 2.053749
H  1.9076 -5.228897 1.773675
H  1.733853 -3.725825 2.689621
H  -1.226035 1.812682 2.67858
H  -2.899674 1.746538 -1.965125
H  -3.45777 0.881779 2.205362
H  -1.957953 -4.226226 0.323175
H  -1.546016 -5.793973 -0.376136
H  -1.564563 -3.125927 -1.894571
H  -2.750904 -4.41873 -2.036829
H  -1.099117 -4.685051 -2.588867
totalener: -2074.24318434 hartree
nucrepener: 3399.20094691 hartree
electener: -5473.44413124 hartree
oneelecener: -9611.85193931 hartree
twoeener: 4138.40780807 hartree
kineticenergy: 2067.62611714 hartree
xcener: -165.663186323003 hartree
chargesum: 0.0000000
charge: -0.030858 -0.171865 -0.168058 -0.170086 -0.242656 -0.286171 -0.275806 -0.317698 -0.382270 -0.335308 -0.340954 0.525460 0.030465 0.148752 0.150654 -0.067234 -0.093061 -0.150774 0.374122 0.162195 -0.068181 -0.048856 -0.282849 0.044111 -0.108214 0.368731 -0.153847 -0.121833 0.550889 0.022315 -0.244789 0.102673 0.147190 0.132296 0.150732 0.103524 0.097912 0.097964 0.133396 0.117925 0.140257 0.088313 0.099856 0.101014 0.083264 0.087362
qa: -0.0309 -0.1719 -0.1681 -0.1701 -0.2427 -0.2862 -0.2758 -0.3177 -0.3823 -0.3353 -0.3410 0.5255 0.0305 0.1488 0.1507 -0.0672 -0.0931 -0.1508 0.3741 0.1622 -0.0682 -0.0489 -0.2828 0.0441 -0.1082 0.3687 -0.1538 -0.1218 0.5509 0.0223 -0.2448 0.1027 0.1472 0.1323 0.1507 0.1035 0.0979 0.0980 0.1334 0.1179 0.1403 0.0883 0.0999 0.1010 0.0833 0.0874
va: 1.2846 1.1362 1.1336 1.1324 2.1536 2.1441 2.1570 2.1862 2.1001 1.9123 1.9211 4.1479 3.9293 3.8610 3.8771 3.9451 3.9031 4.0400 4.2987 3.8898 4.0662 3.7954 3.9574 4.0147 3.9896 4.1088 4.1369 3.9837 4.4328 3.8837 3.9183 1.0229 1.0103 1.0134 1.0215 1.0068 1.0130 1.0057 1.0093 1.0336 1.0117 1.0101 0.9946 1.0140 1.0085 1.0063
dispcorr: -0.024651249 hartree
energy: -2074.267835584390
dipole: 14.60369 -15.77980 -1.17611 -30.89337 30.64093 -0.25244 8.57777 -7.29611 1.28166
magnitude: 1.75773 au
magnitude: 4.46780 debye
