program: Orca
programVersion: 5.0.2
elementType: Cl F F F O O O O O O O N C C C C C C C C C C C C C C C C C C C H H H H H H H H H H H H H H H
charge: 0
multiplicity: 1
keywords: wb97x-d3
keywords: def2-TZVPP
keywords: def2/J RIJCOSX
keywords: DEFGRID2
keywords: scfconv7
keywords: smallprint printgap noloewdin
keywords: NOSOSCF
formula: C19H15ClF3NO7
InChI: InChI=1/C19H15ClF3NO7/c1-3-29-17(25)10(2)30-18(26)13-9-12(5-6-15(13)24(27)28)31-16-7-4-11(8-14(16)20)19(21,22)23/h4-10H,3H2,1-2H3
46 atoms
Cl -0.469012 2.384394 2.5225
F  -4.748973 -0.355683 -0.120269
F  -5.405897 1.187082 1.224863
F  -5.606467 1.454166 -0.901751
O  2.052311 -1.842718 0.557625
O  0.360712 3.196509 -0.179503
O  -0.364748 -4.277257 -0.319329
O  2.220842 -1.732929 -1.678387
O  -0.52093 -2.04877 -0.143622
O  4.838788 -1.127479 -0.273631
O  6.008988 0.660274 -0.401749
N  4.958106 0.073215 -0.337189
C  2.504952 0.236623 -0.381333
C  1.529449 -3.156804 0.480404
C  1.4426 2.381938 -0.218826
C  3.73951 0.863148 -0.318441
C  1.350213 1.001999 -0.32523
C  2.685228 3.006578 -0.164896
C  2.292164 -1.231109 -0.596836
C  -0.883902 2.645429 -0.121511
C  3.831448 2.245059 -0.21382
C  -3.441014 1.586501 -0.003793
C  1.574711 -3.746027 1.880119
C  -1.410986 2.230567 1.096715
C  -1.637597 2.52693 -1.275914
C  0.099846 -3.069742 -0.041009
C  -2.688515 1.701332 1.156307
C  -2.916087 2.00111 -1.219754
C  -4.807395 0.968867 0.051682
C  -1.710687 -4.386774 -0.803437
C  -1.816732 -4.064833 -2.278127
H  2.123242 -3.771721 -0.201951
H  0.390883 0.502101 -0.37031
H  2.742396 4.082899 -0.079041
H  4.799364 2.721503 -0.164961
H  1.203367 -4.768669 1.871591
H  0.973274 -3.163124 2.57715
H  2.601412 -3.76198 2.242674
H  -1.21729 2.854419 -2.217158
H  -3.08062 1.385472 2.112906
H  -3.492871 1.918245 -2.129899
H  -2.372488 -3.749167 -0.214965
H  -1.98296 -5.424211 -0.614139
H  -2.836263 -4.255594 -2.614571
H  -1.147791 -4.689798 -2.86894
H  -1.588362 -3.02058 -2.481449
totalener: -2074.24398026 hartree
nucrepener: 3401.50353756 hartree
electener: -5475.74751782 hartree
oneelecener: -9616.43315849 hartree
twoeener: 4140.68564067 hartree
kineticenergy: 2067.61277598 hartree
xcener: -165.660704412481 hartree
chargesum: -0.0000000
charge: -0.034444 -0.164891 -0.171245 -0.171522 -0.240372 -0.283641 -0.278201 -0.320240 -0.383303 -0.335262 -0.341119 0.525109 0.028366 0.149195 0.197329 -0.071392 -0.114377 -0.175496 0.370849 0.156619 -0.060131 -0.027694 -0.281807 0.053935 -0.109590 0.374035 -0.150309 -0.136948 0.541732 0.025597 -0.248111 0.101948 0.143582 0.131869 0.150261 0.097794 0.098662 0.102940 0.135165 0.121407 0.134064 0.088471 0.099730 0.083706 0.087004 0.100724
qa: -0.0344 -0.1649 -0.1712 -0.1715 -0.2404 -0.2836 -0.2782 -0.3202 -0.3833 -0.3353 -0.3411 0.5251 0.0284 0.1492 0.1973 -0.0714 -0.1144 -0.1755 0.3708 0.1566 -0.0601 -0.0277 -0.2818 0.0539 -0.1096 0.3740 -0.1503 -0.1369 0.5417 0.0256 -0.2481 0.1019 0.1436 0.1319 0.1503 0.0978 0.0987 0.1029 0.1352 0.1214 0.1341 0.0885 0.0997 0.0837 0.0870 0.1007
va: 1.2820 1.1296 1.1345 1.1333 2.1563 2.1487 2.1561 2.1835 2.0953 1.9122 1.9203 4.1461 3.9335 3.8612 3.8445 3.9468 3.9394 4.0610 4.3022 3.9055 4.0586 3.7764 3.9604 4.0082 3.9881 4.0973 4.1177 4.0367 4.4331 3.8836 3.9163 1.0232 1.0166 1.0144 1.0214 1.0133 1.0051 1.0071 1.0077 1.0324 1.0144 1.0105 0.9948 1.0084 1.0062 1.0141
dispcorr: -0.024607040 hartree
energy: -2074.268587303634
dipole: 13.18706 -14.53359 -1.34653 -27.91395 27.97748 0.06354 -8.54938 8.77131 0.22193
magnitude: 1.36617 au
magnitude: 3.47253 debye
