program: Orca
programVersion: 5.0.2
elementType: Cl F F F O O O O O O O N C C C C C C C C C C C C C C C C C C C H H H H H H H H H H H H H H H
charge: 0
multiplicity: 1
keywords: wb97x-d3
keywords: def2-TZVPP
keywords: def2/J RIJCOSX
keywords: DEFGRID2
keywords: scfconv7
keywords: smallprint printgap noloewdin
keywords: NOSOSCF
formula: C19H15ClF3NO7
InChI: InChI=1/C19H15ClF3NO7/c1-3-29-17(25)10(2)30-18(26)13-9-12(5-6-15(13)24(27)28)31-16-7-4-11(8-14(16)20)19(21,22)23/h4-10H,3H2,1-2H3
46 atoms
Cl -1.075859 2.797963 2.876381
F  -4.908037 -0.13735 -0.780837
F  -5.542035 1.092699 0.869039
F  -5.48694 1.900453 -1.12724
O  2.363352 -2.112071 0.5688
O  0.448909 2.869624 0.402662
O  0.0860 -4.686392 -0.259755
O  2.223664 -1.932129 -1.663968
O  -0.261542 -2.506773 0.135933
O  4.977958 -1.251133 -0.694239
O  6.004088 0.583223 -1.102241
N  5.023726 -0.048423 -0.797367
C  2.605475 0.010726 -0.352584
C  1.923942 -3.458216 0.502206
C  1.520822 2.104756 0.090396
C  3.803937 0.688581 -0.514875
C  1.458697 0.723604 -0.038053
C  2.726443 2.778687 -0.076528
C  2.418848 -1.457746 -0.584868
C  -0.811665 2.390596 0.230793
C  3.867697 2.067965 -0.376147
C  -3.431464 1.540458 -0.071936
C  2.112108 -4.066288 1.881348
C  -1.657965 2.336986 1.328963
C  -1.277706 2.009974 -1.020665
C  0.456265 -3.466538 0.093835
C  -2.972285 1.921618 1.176398
C  -2.581168 1.582655 -1.171735
C  -4.849003 1.096404 -0.270535
C  -1.273141 -4.888065 -0.670236
C  -1.498169 -4.470027 -2.107181
H  2.506608 -4.016641 -0.235688
H  0.529272 0.185756 0.103393
H  2.760215 3.853554 0.035735
H  4.808693 2.582905 -0.5016
H  1.523772 -3.539335 2.631932
H  3.160976 -4.018359 2.170093
H  1.810981 -5.111979 1.875251
H  -0.61565 2.054234 -1.87571
H  -3.615697 1.894671 2.043967
H  -2.929982 1.289179 -2.152637
H  -1.950504 -4.360426 0.00305
H  -1.438421 -5.95766 -0.548185
H  -2.516499 -4.725239 -2.401825
H  -0.815669 -4.986932 -2.781072
H  -1.371417 -3.397355 -2.239821
totalener: -2074.24345067 hartree
nucrepener: 3344.40756247 hartree
electener: -5418.65101313 hartree
oneelecener: -9502.08577671 hartree
twoeener: 4083.43476358 hartree
kineticenergy: 2067.62190332 hartree
xcener: -165.661959100432 hartree
chargesum: -0.0000000
charge: -0.036202 -0.169257 -0.171441 -0.168993 -0.241295 -0.281978 -0.275141 -0.320602 -0.377242 -0.332228 -0.338923 0.522443 0.037782 0.149583 0.220047 -0.066136 -0.145009 -0.183052 0.368581 0.186190 -0.060797 -0.063047 -0.282477 0.013083 -0.138114 0.362889 -0.117491 -0.127999 0.550144 0.023782 -0.245942 0.103330 0.156186 0.135722 0.151326 0.100938 0.102815 0.097924 0.143132 0.129382 0.127896 0.089938 0.099318 0.083008 0.087797 0.100127
qa: -0.0362 -0.1693 -0.1714 -0.1690 -0.2413 -0.2820 -0.2751 -0.3206 -0.3772 -0.3322 -0.3389 0.5224 0.0378 0.1496 0.2200 -0.0661 -0.1450 -0.1831 0.3686 0.1862 -0.0608 -0.0630 -0.2825 0.0131 -0.1381 0.3629 -0.1175 -0.1280 0.5501 0.0238 -0.2459 0.1033 0.1562 0.1357 0.1513 0.1009 0.1028 0.0979 0.1431 0.1294 0.1279 0.0899 0.0993 0.0830 0.0878 0.1001
va: 1.2802 1.1334 1.1363 1.1319 2.1600 2.1478 2.1574 2.1806 2.1032 1.9151 1.9214 4.1434 3.9073 3.8539 3.8692 3.9515 3.9416 4.0458 4.2996 3.8763 4.0490 3.7988 3.9563 4.0210 3.9803 4.1145 4.0081 4.0728 4.4327 3.8833 3.9176 1.0228 1.0101 1.0123 1.0208 1.0054 1.0070 1.0127 0.9993 1.0298 1.0157 1.0098 0.9949 1.0086 1.0060 1.0139
dispcorr: -0.023754909 hartree
energy: -2074.267205574222
dipole: 17.87124 -18.78514 -0.91391 -32.45575 32.27330 -0.18244 -6.61660 7.04988 0.43329
magnitude: 1.02774 au
magnitude: 2.61231 debye
