program: Orca
programVersion: 5.0.2
elementType: Cl S F F F O O O O O O N N C C C C C C C C C C C C C C C H H H H H H H H H H
charge: 0
multiplicity: 1
keywords: wb97x-d3
keywords: def2-TZVPP
keywords: def2/J RIJCOSX
keywords: DEFGRID2
keywords: scfconv7
keywords: smallprint printgap noloewdin
keywords: NOSOSCF
formula: C15H10ClF3N2O6S
InChI: InChI=1/C15H10ClF3N2O6S/c1-28(25,26)20-14(22)10-7-9(3-4-12(10)21(23)24)27-13-5-2-8(6-11(13)16)15(17,18)19/h2-7,20H,1H3
38 atoms
Cl -1.114267 1.453798 -0.370048
S  3.369706 2.349447 0.285963
F  -6.583724 0.597311 -0.426936
F  -5.771075 -0.207323 -2.243054
F  -6.631309 -1.525363 -0.777668
O  -0.885838 -0.725849 1.636187
O  4.541905 -0.831332 2.109109
O  4.398667 3.350647 0.0805
O  2.807741 1.64151 -0.847412
O  4.761015 -0.859972 -0.853777
O  3.864427 -2.401513 -2.028022
N  4.078898 1.21988 1.316669
N  3.826929 -1.574294 -1.148531
C  2.60658 -0.663018 0.770383
C  0.241215 -1.001228 0.932338
C  2.604443 -1.413714 -0.402093
C  1.422335 -0.483315 1.451987
C  3.843458 -0.124492 1.420988
C  -2.082574 -0.683773 0.975758
C  0.242076 -1.759678 -0.229547
C  1.435249 -1.969009 -0.893574
C  -4.547737 -0.554503 -0.268048
C  -2.331133 0.298238 0.019415
C  -3.068538 -1.592785 1.307816
C  -3.561113 0.363671 -0.604558
C  -4.30844 -1.525362 0.693021
C  2.062139 3.058012 1.242053
C  -5.884562 -0.430321 -0.928644
H  1.395663 0.081059 2.376201
H  -0.669536 -2.182868 -0.629699
H  1.436971 -2.550526 -1.804098
H  4.874343 1.573912 1.844327
H  -2.866174 -2.348912 2.054375
H  -3.738936 1.134645 -1.342599
H  -5.067765 -2.242498 0.970657
H  1.348979 2.290627 1.530996
H  2.482058 3.532914 2.125932
H  1.569642 3.804765 0.618632
elementType: Cl S F O N C H
totalener: -2296.50970489 hartree
nucrepener: 3107.60885295 hartree
electener: -5404.11855784 hartree
oneelecener: -9340.09170699 hartree
twoeener: 3935.97314914 hartree
cpcmener: -0.05939783 hartree
kineticenergy: 2289.67184837 hartree
xcener: -167.491033200694 hartree
chargesum: -0.0000000
charge: -0.062827 0.850023 -0.181191 -0.182530 -0.178563 -0.304412 -0.424546 -0.518932 -0.496732 -0.390907 -0.395932 -0.156839 0.582557 -0.056586 0.188380 0.020879 -0.185645 0.361413 0.209436 -0.100634 -0.079874 -0.039942 0.075926 -0.172346 -0.153078 -0.124414 -0.226329 0.560958 0.166079 0.165847 0.163242 0.206320 0.158145 0.134952 0.156313 0.131675 0.153139 0.146976
qa: -0.0628 0.8500 -0.1812 -0.1825 -0.1786 -0.3044 -0.4245 -0.5189 -0.4967 -0.3909 -0.3959 -0.1568 0.5826 -0.0566 0.1884 0.0209 -0.1856 0.3614 0.2094 -0.1006 -0.0799 -0.0399 0.0759 -0.1723 -0.1531 -0.1244 -0.2263 0.5610 0.1661 0.1658 0.1632 0.2063 0.1581 0.1350 0.1563 0.1317 0.1531 0.1470
va: 1.2596 5.7519 1.1099 1.1180 1.1261 2.1060 2.0709 1.9710 1.9594 1.8580 1.8663 3.1161 4.0730 3.8718 3.8558 3.7806 4.0247 4.2302 3.7619 3.9125 4.0510 3.6925 3.9619 3.9944 4.1204 3.9550 3.8712 4.4158 1.0014 0.9927 1.0136 1.0083 1.0005 1.0265 1.0045 1.0086 1.0110 1.0059
dispcorr: -0.023835798 hartree
energy: -2296.533540688197
dipole: 20.09873 -23.83340 -3.73467 1.88224 -1.39243 0.48980 10.85184 -8.34213 2.50971
magnitude: 4.52619 au
magnitude: 11.50465 debye
