program: Orca
programVersion: 5.0.2
elementType: Cl S F F F O O O O O O N N C C C C C C C C C C C C C C C H H H H H H H H H H
charge: 0
multiplicity: 1
keywords: wb97x-d3
keywords: def2-TZVPP
keywords: def2/J RIJCOSX
keywords: DEFGRID2
keywords: scfconv7
keywords: smallprint printgap noloewdin
keywords: NOSOSCF
formula: C15H10ClF3N2O6S
InChI: InChI=1/C15H10ClF3N2O6S/c1-28(25,26)20-14(22)10-7-9(3-4-12(10)21(23)24)27-13-5-2-8(6-11(13)16)15(17,18)19/h2-7,20H,1H3
38 atoms
Cl -1.637682 -2.603981 1.606777
S  2.955585 2.421466 -1.070541
F  -6.248635 0.990357 -0.661569
F  -6.275708 -0.161548 1.153019
F  -5.235847 1.718951 1.092069
O  -0.78991 -2.043972 -1.161106
O  2.049903 0.937288 2.362794
O  2.929567 1.149188 -1.763341
O  2.156526 3.530533 -1.54937
O  4.620423 0.12433 0.985769
O  5.224131 -1.796064 0.27897
N  2.468192 2.143227 0.515573
N  4.385068 -0.95245 0.475944
C  2.034667 -0.28357 0.352662
C  0.444835 -1.719941 -0.719033
C  3.025207 -1.221113 0.088637
C  0.733721 -0.539738 -0.043925
C  2.238921 0.958814 1.171349
C  -1.892355 -1.346445 -0.762702
C  1.445849 -2.644845 -0.99994
C  2.736467 -2.393679 -0.595722
C  -4.245736 -0.082597 -0.039917
C  -2.428967 -1.543523 0.506033
C  -2.524164 -0.503675 -1.65828
C  -3.604264 -0.913421 0.870482
C  -3.704658 0.127567 -1.301153
C  4.628518 2.972779 -0.897799
C  -5.504844 0.614104 0.381243
H  -0.038893 0.191297 0.161351
H  1.207256 -3.556157 -1.531678
H  3.511848 -3.113253 -0.815181
H  2.452705 2.971649 1.107674
H  -2.099555 -0.355591 -2.642866
H  -4.010541 -1.084371 1.858608
H  -4.186469 0.77516 -2.020927
H  4.995461 3.206752 -1.898112
H  4.656828 3.869773 -0.281757
H  5.235888 2.187323 -0.456098
elementType: Cl S F O N C H
totalener: -2296.51269118 hartree
nucrepener: 3092.31599067 hartree
electener: -5388.82868186 hartree
oneelecener: -9310.61959668 hartree
twoeener: 3921.79091482 hartree
cpcmener: -0.04234281 hartree
kineticenergy: 2289.64969959 hartree
xcener: -167.484578260546 hartree
chargesum: 0.0000000
charge: -0.052761 0.835881 -0.177756 -0.180450 -0.178644 -0.291237 -0.399390 -0.491096 -0.507098 -0.408120 -0.382517 -0.155807 0.591236 -0.067258 0.226183 0.005721 -0.076920 0.344050 0.199211 -0.199760 -0.063803 -0.030928 0.045343 -0.148375 -0.144722 -0.139539 -0.224439 0.555697 0.144568 0.152475 0.159905 0.190298 0.156898 0.134646 0.155184 0.141249 0.142187 0.139890
qa: -0.0528 0.8359 -0.1778 -0.1804 -0.1786 -0.2912 -0.3994 -0.4911 -0.5071 -0.4081 -0.3825 -0.1558 0.5912 -0.0673 0.2262 0.0057 -0.0769 0.3440 0.1992 -0.1998 -0.0638 -0.0309 0.0453 -0.1484 -0.1447 -0.1395 -0.2244 0.5557 0.1446 0.1525 0.1599 0.1903 0.1569 0.1346 0.1552 0.1412 0.1422 0.1399
va: 1.2624 5.7688 1.1260 1.1216 1.1115 2.1390 2.1056 1.9643 1.9787 1.8373 1.8827 3.1173 4.0681 3.9249 3.7853 3.8388 3.9412 4.2554 3.8136 4.0542 4.0476 3.6971 3.9803 3.9915 4.0992 3.9818 3.8746 4.4184 1.0097 1.0064 1.0146 1.0152 1.0002 1.0266 1.0051 1.0085 1.0054 1.0145
dispcorr: -0.022507057 hartree
energy: -2296.535198236844
dipole: 30.00692 -29.94323 0.06368 6.07580 -5.68716 0.38864 -9.74849 8.46733 -1.28116
magnitude: 1.34032 au
magnitude: 3.40683 debye
