program: Orca
programVersion: 5.0.2
elementType: Cl S F F F O O O O O O N N C C C C C C C C C C C C C C C H H H H H H H H H H
charge: 0
multiplicity: 1
keywords: wb97x-d3
keywords: def2-TZVPP
keywords: def2/J RIJCOSX
keywords: DEFGRID2
keywords: scfconv7
keywords: smallprint printgap noloewdin
keywords: NOSOSCF
formula: C15H10ClF3N2O6S
InChI: InChI=1/C15H10ClF3N2O6S/c1-28(25,26)20-14(22)10-7-9(3-4-12(10)21(23)24)27-13-5-2-8(6-11(13)16)15(17,18)19/h2-7,20H,1H3
38 atoms
Cl -1.328386 1.531748 -0.360701
S  3.442201 2.435503 0.466942
F  -5.976198 0.060761 -2.178018
F  -6.389708 -1.897008 -1.392696
F  -6.902813 -0.154029 -0.249533
O  -0.983622 -0.702782 1.550113
O  4.391599 -0.821341 2.286664
O  2.361155 1.855036 -0.301152
O  3.209785 3.623627 1.261804
O  4.778087 -0.749502 -0.666893
O  3.920403 -2.195041 -1.982631
N  4.002096 1.261081 1.538988
N  3.849293 -1.427769 -1.054771
C  2.542558 -0.594316 0.842461
C  0.171211 -0.936288 0.882359
C  2.595045 -1.29666 -0.357518
C  1.325318 -0.433832 1.471134
C  3.75054 -0.088658 1.57436
C  -2.168201 -0.716277 0.873332
C  0.227101 -1.641932 -0.313252
C  1.44824 -1.823815 -0.929499
C  -4.623743 -0.698637 -0.4059
C  -2.472952 0.286469 -0.041816
C  -3.09522 -1.706781 1.146817
C  -3.699298 0.298063 -0.682503
C  -4.326237 -1.696266 0.514783
C  4.838372 2.719281 -0.583569
C  -5.9710 -0.671648 -1.061231
H  1.255771 0.112726 2.403367
H  -0.664437 -2.045806 -0.774424
H  1.493137 -2.362821 -1.864907
H  4.756068 1.572941 2.148995
H  -2.850994 -2.480989 1.862248
H  -3.915703 1.089482 -1.386771
H  -5.039528 -2.47617 0.745218
H  5.687937 3.040023 0.016429
H  5.079525 1.811077 -1.130212
H  4.565085 3.510737 -1.281974
elementType: Cl S F O N C H
totalener: -2296.51213146 hartree
nucrepener: 3081.73839613 hartree
electener: -5378.25052759 hartree
oneelecener: -9289.58860972 hartree
twoeener: 3911.33808213 hartree
cpcmener: -0.04311886 hartree
kineticenergy: 2289.66883568 hartree
xcener: -167.487131814852 hartree
chargesum: 0.0000000
charge: -0.053443 0.837634 -0.179184 -0.180471 -0.179348 -0.296894 -0.397169 -0.486153 -0.506716 -0.397258 -0.380922 -0.159544 0.580969 -0.061909 0.185296 0.051440 -0.137547 0.328640 0.201206 -0.099995 -0.099547 -0.039196 0.055612 -0.165392 -0.130536 -0.143324 -0.225545 0.558525 0.140100 0.160991 0.161140 0.191959 0.155799 0.134403 0.152590 0.141898 0.139422 0.142467
qa: -0.0534 0.8376 -0.1792 -0.1805 -0.1793 -0.2969 -0.3972 -0.4862 -0.5067 -0.3973 -0.3809 -0.1595 0.5810 -0.0619 0.1853 0.0514 -0.1375 0.3286 0.2012 -0.1000 -0.0995 -0.0392 0.0556 -0.1654 -0.1305 -0.1433 -0.2255 0.5585 0.1401 0.1610 0.1611 0.1920 0.1558 0.1344 0.1526 0.1419 0.1394 0.1425
va: 1.2679 5.7641 1.1245 1.1207 1.1114 2.1201 2.1037 1.9748 1.9781 1.8449 1.8831 3.1135 4.0708 3.8827 3.8445 3.8013 4.0654 4.2602 3.7959 3.8941 4.0695 3.6984 3.9814 3.9825 4.0613 4.0020 3.8771 4.4138 1.0186 0.9961 1.0158 1.0145 1.0012 1.0268 1.0062 1.0053 1.0138 1.0084
dispcorr: -0.022904269 hartree
energy: -2296.535035729512
dipole: 29.72699 -30.11369 -0.38670 1.36818 -1.35177 0.01642 4.65573 -4.71593 -0.06019
magnitude: 0.39171 au
magnitude: 0.99564 debye
